{"text_format":"3","workbook":"xlsx","n_sheets":3,"sheets":["Sheet1","Sheet2","Sheet3"],"not_rendered":{"external_links":1},"read":"whole","date_system":"1900"}

{"sheet":"Sheet1","index":0,"n_rows":28,"n_cols":5,"rows_kept":28,"merged":[[0,0,0,4],[24,3,24,4],[27,3,27,4]]}
["DAFTAR KELAS YANG AKAN DI RESET"]
[]
["NO.","KODE","MATA KULIAH","KELAS","JUMLAH"]
[1,"TI052     ",{"$f":"VLOOKUP(TRIM(B4),[1]mk!$A$2:$B$225,2,0)","v":"Visualisasi 3D"},"TI13C V3D",64]
[2,"TI052     ",{"$f":"VLOOKUP(TRIM(B5),[1]mk!$A$2:$B$225,2,0)","v":"Visualisasi 3D"},"TI13B V3D",58]
[3,"TI031     ",{"$f":"VLOOKUP(TRIM(B6),[1]mk!$A$2:$B$225,2,0)","v":"Interaksi Manusia dan Komputer"},"TI13C IMK",58]
[4,"TI021     ",{"$f":"VLOOKUP(TRIM(B7),[1]mk!$A$2:$B$225,2,0)","v":"Keamanan Jaringan"},"TI14F KJ",57]
[5,"SI137     ",{"$f":"VLOOKUP(TRIM(B8),[1]mk!$A$2:$B$225,2,0)","v":"Semantic Web"},"SI13A SW",57]
[6,"SI136     ",{"$f":"VLOOKUP(TRIM(B9),[1]mk!$A$2:$B$225,2,0)","v":"IT Forensic"},"SI13A ITF",57]
[7,"SI135     ",{"$f":"VLOOKUP(TRIM(B10),[1]mk!$A$2:$B$225,2,0)","v":"Statistik"},"SI13A Statistik",57]
[8,"SI132     ",{"$f":"VLOOKUP(TRIM(B11),[1]mk!$A$2:$B$225,2,0)","v":"Seni Budaya Banyumasan"},"SI13A SBB",56]
[9,"TI052     ",{"$f":"VLOOKUP(TRIM(B12),[1]mk!$A$2:$B$225,2,0)","v":"Visualisasi 3D"},"TI13A V3D",55]
[10,"TI036     ",{"$f":"VLOOKUP(TRIM(B13),[1]mk!$A$2:$B$225,2,0)","v":"Arsitektur Keamanan & Sistem Administrator"},"TI13C AKSA",55]
[11,"TI035     ",{"$f":"VLOOKUP(TRIM(B14),[1]mk!$A$2:$B$225,2,0)","v":"Data Mining"},"TI13C DM",55]
[12,"TI035     ",{"$f":"VLOOKUP(TRIM(B15),[1]mk!$A$2:$B$225,2,0)","v":"Data Mining"},"TI13G DM",55]
[13,"TI034     ",{"$f":"VLOOKUP(TRIM(B16),[1]mk!$A$2:$B$225,2,0)","v":"Pengantar Manajemen"},"TI13C PM",55]
[14,"TI033     ",{"$f":"VLOOKUP(TRIM(B17),[1]mk!$A$2:$B$225,2,0)","v":"Metode Pengembangan Perangkat Lunak"},"TI13C MPPL",55]
[15,"TI032     ",{"$f":"VLOOKUP(TRIM(B18),[1]mk!$A$2:$B$225,2,0)","v":"Pengolahan Citra Digital"},"TI13C PCD",55]
[16,"TI036     ",{"$f":"VLOOKUP(TRIM(B19),[1]mk!$A$2:$B$225,2,0)","v":"Arsitektur Keamanan & Sistem Administrator"},"TI13A AKSA",53]
[17,"TI034     ",{"$f":"VLOOKUP(TRIM(B20),[1]mk!$A$2:$B$225,2,0)","v":"Pengantar Manajemen"},"TI13A PM",53]
[18,"TI033     ",{"$f":"VLOOKUP(TRIM(B21),[1]mk!$A$2:$B$225,2,0)","v":"Metode Pengembangan Perangkat Lunak"},"TI13A MPPL",53]
[19,"TI032     ",{"$f":"VLOOKUP(TRIM(B22),[1]mk!$A$2:$B$225,2,0)","v":"Pengolahan Citra Digital"},"TI13A PCD",53]
[20,"TI031     ",{"$f":"VLOOKUP(TRIM(B23),[1]mk!$A$2:$B$225,2,0)","v":"Interaksi Manusia dan Komputer"},"TI13A IMK",53]
[]
[{"$nulls":3},"Purwokerto, 29 Agustus 2015"]
[]
[]
[{"$nulls":3},"BAAK"]

{"sheet":"Sheet2","index":1,"n_rows":0,"n_cols":0,"rows_kept":0}

{"sheet":"Sheet3","index":2,"n_rows":0,"n_cols":0,"rows_kept":0}