{"text_format":"3","workbook":"xlsx","n_sheets":3,"sheets":["Sheet1","Sheet2","Sheet3"],"not_rendered":{"external_links":1},"read":"whole","date_system":"1900"}

{"sheet":"Sheet1","index":0,"n_rows":40,"n_cols":7,"rows_kept":40,"merged":[[0,0,0,6],[31,0,31,6]]}
[" 1. Jadwal Ujian SKRIPSI Gelombang 1 (Ganjil 2015/2016)"]
[]
[]
["No","Nim","Nama","Hari","Tanggal","Jam","Ruang"]
[1,"12.11.0108","Defri Maulana Efendi","Senin","15 Februari 2016","08.30","R.Rapat"]
[2,"12.12.0194","Ana Susanti","Senin","15 Februari 2016","08.30","R.Aula"]
[3,"12.11.0373","Elya Sinatrya","Senin","15 Februari 2016","08.30","R.Skripsi 1"]
[4,"12.12.0117","Okky Sunando","Senin","15 Februari 2016","08.30","R. KP 1"]
[5,"12.12.0363","Maria Retno Wahyuni","Senin","15 Februari 2016","10.30","R.Aula"]
[6,"12.12.0290","Rini Sutriani","Senin","15 Februari 2016","10.30","R.Rapat"]
[7,"10.12.1305","Ikhtiar Mar'Atun Kh","Senin","15 Februari 2016","10.30","R.Skripsi 1"]
[8,"12.11.0198","Nunung Budiyanti","Senin","15 Februari 2016","10.30","R. KP 1"]
[9,"09.12.0940","Haris Hermawan","Senin","15 Februari 2016","13.00","R.Rapat"]
[10,"12.12.0107","Johan Agung Purnama","Senin","15 Februari 2016","13.00","R.Skripsi 1"]
[11,"11.11.2350","Jefri Setiaji","Senin","15 Februari 2016","13.00","R. KP 1"]
[12,"12.11.0082","Fina Alfin Farkhati","Senin","15 Februari 2016","14.30","R.Rapat"]
[13,"12.12.0176","Fajriyatun Nasihah","Senin","15 Februari 2016","14.30","R.Skripsi 1"]
[14,"12.11.0252","Tusimah","Senin","15 Februari 2016","14.30","R. KP 1"]
[15,"11.11.2506",{"$f":"VLOOKUP(B19,[1]Sheet1!A$2:B$5450,2,0)","v":"Erna Sunarni"},"Senin","15 Februari 2016","14.30","R.Aula"]
[16,"12.11.0148",{"$f":"VLOOKUP(B20,[1]Sheet1!A$2:B$5450,2,0)","v":"Fevi Awalia"},"Senin","15 Februari 2016","16:00:00","R.Skripsi 1"]
[17,"11.11.2633","Mashuri Rakasiwi","Senin","15 Februari 2016","16:00:00","R. KP 1"]
[18,"12.11.0142","Nindhita Aprillia Iriani","Rabu","17 Februari 2016","08:30","R.Skripsi 1"]
[19,"14.11.0413","Aam Hamdan","Rabu","17 Februari 2016","08:30","R.Rapat"]
[20,"10.11.1665",{"$f":"VLOOKUP(B24,[1]Sheet1!A$2:B$5450,2,0)","v":"Dwi Wulan Rahmi"},"Rabu","17 Februari 2016","08:30","R. KP 1"]
[21,"12.12.0108","Eva Nurjanah","Rabu","17 Februari 2016","10.30","R.Skripsi 1"]
[22,"11.11.2262","Dwi Sumarti","Rabu","17 Februari 2016","13.00","R.Skripsi 1"]
[23,"12.12.0205","Novena Kurniati","Rabu","17 Februari 2016","14.30","R.Skripsi 1"]
[24,"11.12.2025","Sofyan Najib","Rabu","17 Februari 2016","16:00:00","R.Skripsi 1"]
[25,"12.12.0069",{"$f":"VLOOKUP(B29,[1]Sheet1!A$2:B$5450,2,0)","v":"Dody Noerrahim"},"Kamis","18 Februari 2016","10.30","R.Rapat"]
[26,"12.12.0185","Laeli Khusnul Khotimah","Kamis","18 Februari 2016","14:30:00","R.Aula"]
[]
[" 2. Jadwal Ujian ULANG KP Ganjil 2015/2016"]
[]
["No","Nim","Nama","Hari","Tanggal","Jam","Ruang"]
[1,"11.12.2060",{"$f":"VLOOKUP(B35,[1]Sheet1!A$2:B$5450,2,0)","v":"Leni Maryuna"},"Selasa","16 Februari 2016","08:30:00","R. 3.7"]
[2,"11.11.2519",{"$f":"VLOOKUP(B36,[1]Sheet1!A$2:B$5450,2,0)","v":"Panji Suminar"},"Selasa","16 Februari 2016","08:30:00","R. 3.8"]
[3,"11.11.2502",{"$f":"VLOOKUP(B37,[1]Sheet1!A$2:B$5450,2,0)","v":"Fahmi Rizal Mustopa"},"Selasa","16 Februari 2016","10.30","R. 3.7"]
[4,"12.11.0128",{"$f":"VLOOKUP(B38,[1]Sheet1!A$2:B$5450,2,0)","v":"Ana Resa Septianti"},"Selasa","16 Februari 2016","10.30","R. 3.8"]
[5,"12.12.0326",{"$f":"VLOOKUP(B39,[1]Sheet1!A$2:B$5450,2,0)","v":"Oki Dwi Purnomo"},"Selasa","16 Februari 2016","14:30:00","R. Aula"]
[6,"11.11.2480",{"$f":"VLOOKUP(B40,[1]Sheet1!A$2:B$5450,2,0)","v":"Ririn Tiarasona"},"Selasa","16 Februari 2016","14:30:00","R. 3.7"]

{"sheet":"Sheet2","index":1,"n_rows":0,"n_cols":0,"rows_kept":0}

{"sheet":"Sheet3","index":2,"n_rows":0,"n_cols":0,"rows_kept":0}