{"text_format":"3","workbook":"xlsx","n_sheets":2,"sheets":["Jadwal 1","Jadwal 2"],"not_rendered":{"external_links":1},"read":"whole","date_system":"1900"}

{"sheet":"Jadwal 1","index":0,"n_rows":117,"n_cols":9,"rows_kept":117,"merged":[[2,0,2,3]]}
["Try Out dan Ujian Sertifikasi Internasional"]
["Tanggal 1 Maret 2017 (Pelaksanaan Try Out) & 14 Maret 2017 (Pelaksanaan Ujian)"]
[]
["Jam 08.30 s.d. 10.00 - Lab 1",{"$nulls":4},"Jam 08.30 s.d. 10.00 - Lab 7"]
["NO","NIM","NAMA","PILIHAN",null,"NO","NIM","NAMA","PILIHAN"]
[1,"12.11.0394",{"$f":"IFERROR(VLOOKUP(B6,[1]Sheet1!A$2:B$5450,2,0),\"\")","v":"RICKO HAVIANANTO"},"FCNS",null,1,"14.12.0047","SETYA ANDI YANTO","FCNS"]
[2,"12.12.0235",{"$f":"IFERROR(VLOOKUP(B7,[1]Sheet1!A$2:B$5450,2,0),\"\")","v":"DENI AGUS PRIYANTO"},"FCNS",null,2,"14.12.0050","RIZKIKA PITALIARNI","FCNS"]
[3,"12.12.0350",{"$f":"IFERROR(VLOOKUP(B8,[1]Sheet1!A$2:B$5450,2,0),\"\")","v":"DAVID RAHMAN NURROZAK"},"FCNS",null,3,"14.12.0053","SRI LESTARI","FCNS"]
[4,"13.11.0253",{"$f":"IFERROR(VLOOKUP(B9,[1]Sheet1!A$2:B$5450,2,0),\"\")","v":"INDRA REZA RAMADHAN"},"FCNS",null,4,"14.12.0058","GILANG SISTRIYOKO","FCNS"]
[5,"14.11.0131",{"$f":"IFERROR(VLOOKUP(B10,[1]Sheet1!A$2:B$5450,2,0),\"\")","v":"KHOERUL AZNI"},"FCNS",null,5,"14.12.0060","KHOLIFAH","FCNS"]
[6,"14.11.0132",{"$f":"IFERROR(VLOOKUP(B11,[1]Sheet1!A$2:B$5450,2,0),\"\")","v":"AGUNG TRI CAHYONO"},"FCNS",null,6,"14.12.0065","YODI GAGAH PRASETYO","FCNS"]
[7,"14.11.0148",{"$f":"IFERROR(VLOOKUP(B12,[1]Sheet1!A$2:B$5450,2,0),\"\")","v":"YOGI ARIF GUNAWAN SAMSUDIN"},"FCNS",null,7,"14.12.0067","ANGGITA DYAH PITALOKA","FCNS"]
[8,"14.11.0152",{"$f":"IFERROR(VLOOKUP(B13,[1]Sheet1!A$2:B$5450,2,0),\"\")","v":"KABUL AGUS PUWANTO"},"FCNS",null,8,"14.12.0070","YOSA RIO","FCNS"]
[9,"14.11.0161",{"$f":"IFERROR(VLOOKUP(B14,[1]Sheet1!A$2:B$5450,2,0),\"\")","v":"KURNIAWAN NOVI PAMBUDI"},"FCNS",null,9,"14.12.0076","YULIAWAN ADI WIBOWO","FCNS"]
[10,"14.11.0168",{"$f":"IFERROR(VLOOKUP(B15,[1]Sheet1!A$2:B$5450,2,0),\"\")","v":"FANNY TRI PAMUNGKAS"},"FCNS",null,10,"14.12.0081","CICI YUNI ASTITI","FCNS"]
[11,"14.11.0184",{"$f":"IFERROR(VLOOKUP(B16,[1]Sheet1!A$2:B$5450,2,0),\"\")","v":"SETYO HARTANTO"},"FCNS",null,11,"14.12.0084","DHIKA ZHULFIANTO BUDI D","FCNS"]
[12,"14.11.0194",{"$f":"IFERROR(VLOOKUP(B17,[1]Sheet1!A$2:B$5450,2,0),\"\")","v":"YULIANI DWI ASIH"},"FCNS",null,12,"14.12.0090","AULIA PRICILLA FUADA","FCNS"]
[13,"14.11.0201",{"$f":"IFERROR(VLOOKUP(B18,[1]Sheet1!A$2:B$5450,2,0),\"\")","v":"ITA FITRIANI"},"FCNS",null,13,"14.12.0091","MUHAMMAD AGHNI ALFARISI","FCNS"]
[14,"14.11.0292",{"$f":"IFERROR(VLOOKUP(B19,[1]Sheet1!A$2:B$5450,2,0),\"\")","v":"ASHAR KURNIAWAN"},"FCNS",null,14,"14.12.0101","PANGGIH BAGAS BIMANTARA","FCNS"]
[15,"14.11.0317",{"$f":"IFERROR(VLOOKUP(B20,[1]Sheet1!A$2:B$5450,2,0),\"\")","v":"RIKI AJI PAMUNGKAS"},"FCNS",null,15,"14.12.0109","NUR GONGGO REZA PRADANA","FCNS"]
[16,"14.11.0335",{"$f":"IFERROR(VLOOKUP(B21,[1]Sheet1!A$2:B$5450,2,0),\"\")","v":"WELY ANDIKA"},"FCNS",null,16,"14.12.0115","RAHMAH AKHIRIANI","FCNS"]
[17,"14.12.0008",{"$f":"IFERROR(VLOOKUP(B22,[1]Sheet1!A$2:B$5450,2,0),\"\")","v":"WARDOYO"},"FCNS",null,17,"14.12.0121","IQBAL WAFI","FCNS"]
[18,"14.12.0010",{"$f":"IFERROR(VLOOKUP(B23,[1]Sheet1!A$2:B$5450,2,0),\"\")","v":"FACHRIZAL DWI JANUARDHI"},"FCNS",null,18,"14.12.0123","AWANDA ZULFIKAR ARIYANTO","FCNS"]
[19,"14.12.0011",{"$f":"IFERROR(VLOOKUP(B24,[1]Sheet1!A$2:B$5450,2,0),\"\")","v":"HILMAN ADI HAIKAL"},"FCNS",null,19,"14.12.0142","AWAN MART DIANA PUTRI UTAMI","FCNS"]
[20,"14.12.0012",{"$f":"IFERROR(VLOOKUP(B25,[1]Sheet1!A$2:B$5450,2,0),\"\")","v":"PURNAMA ADY SAPUTRA"},"FCNS",null,20,"14.12.0162","AKHMAD SONI WIDIANTO","FCNS"]
[21,"14.12.0028",{"$f":"IFERROR(VLOOKUP(B26,[1]Sheet1!A$2:B$5450,2,0),\"\")","v":"HENDRA BUDI ARIFIN"},"FCNS",null,21,"12.11.0081","SAMSUL MUARIF","FCNS"]
[22,"14.12.0030",{"$f":"IFERROR(VLOOKUP(B27,[1]Sheet1!A$2:B$5450,2,0),\"\")","v":"WINDA ZANUAR ABIDIN"},"FCNS",null,22,"14.12.0158","ATIEK KURNIASIH","FCNS"]
[23,"14.12.0035",{"$f":"IFERROR(VLOOKUP(B28,[1]Sheet1!A$2:B$5450,2,0),\"\")","v":"HELMI RAHMAT YUDHISTIRA"},"FCNS",null,23,"14.12.0186","WILDA AMALIA TANJUNG","FCNS"]
[24,"14.12.0041",{"$f":"IFERROR(VLOOKUP(B29,[1]Sheet1!A$2:B$5450,2,0),\"\")","v":"NURUL DWI RIFAI"},"FCNS",null,24,"14.12.0192","ROBI IRSA'NI","FCNS"]
[25,"14.12.0043",{"$f":"IFERROR(VLOOKUP(B30,[1]Sheet1!A$2:B$5450,2,0),\"\")","v":"MARIA KARTIKA"},"FCNS",null,25,"14.12.0197","LATOIF","FCNS"]
[]
[]
["Jam 10.30 s.d. 12.00 - Lab 1",{"$nulls":4},"Jam 10.30 s.d. 12.00 - Lab 7"]
["NO","NIM","NAMA","PILIHAN",null,"NO","NIM","NAMA","PILIHAN"]
[1,"14.12.0207","RIZIK AMARULLOH","FCNS",null,1,"15.11.0053","MUHAMMAD ARMANZANI","FCNS"]
[2,"14.12.0214","ARIF HIDAYAT","FCNS",null,2,"15.11.0056","ISNAN ADITIA","FCNS"]
[3,"14.12.0237","SRI LESTARI","FCNS",null,3,"15.11.0058","RIFQI FAKHRUDIN","FCNS"]
[4,"14.12.0247","IKA AYU PRASETYADIANTI","FCNS",null,4,"15.11.0060","DEDI WAHYUDI","FCNS"]
[5,"14.12.0249","RAKA NANDA SAPUTRA","FCNS",null,5,"15.11.0062","ADIMAS DWI NUR HIDAYAH","FCNS"]
[6,"14.12.0262","RISKA AULIA RAHMAN","FCNS",null,6,"15.11.0065","AGUNG EDI  WIJAYANTO","FCNS"]
[7,"15.11.0002","KUKUH NUGROHO","FCNS",null,7,"15.11.0069","TAUFIK HIDAYAT","FCNS"]
[8,"15.11.0003","GIYAN WAHYU SAWIJI","FCNS",null,8,"15.11.0072","SEVANA MEDIA NUGRAHA","FCNS"]
[9,"15.11.0004","SRI RADHIKA WISNU WARDANI","FCNS",null,9,"15.11.0075","YULIADI FAJAR PANGESTU","FCNS"]
[10,"15.11.0006","TRI WIDIANTO","FCNS",null,10,"15.11.0080","ADI PURNOMO","FCNS"]
[11,"15.11.0014","AAN HISBULLAH","FCNS",null,11,"15.11.0081","M NAFI MUDHOFFAR","FCNS"]
[12,"15.11.0016","IKMAM NUR FAUZI","FCNS",null,12,"15.11.0082","AJI DIWANTORO","FCNS"]
[13,"15.11.0021","IMAM HIDAYATULLAH","FCNS",null,13,"15.11.0084","YA'RIFUDDIN FAHMI","FCNS"]
[14,"15.11.0023","GIGIH GUMELAR PANGESTU","FCNS",null,14,"15.11.0086","SUPRIATIN","FCNS"]
[15,"15.11.0026","GAYUH PANDU PRAYOGA","FCNS",null,15,"15.11.0087","ADI DWIYAN SAPUTRA","FCNS"]
[16,"15.11.0027","MIFTAKHUL ARIFIN","FCNS",null,16,"15.11.0088","HENIKA CANDRAWATI","FCNS"]
[17,"15.11.0028","RIYAN NANDA PRATAMA","FCNS",null,17,"15.11.0090","AZAM MAULANA","FCNS"]
[18,"15.11.0035","ULFI YULIANA","FCNS",null,18,"15.11.0091","KANA FITRA BHASKARA","FCNS"]
[19,"15.11.0037","YUSUF BUDIAJI","FCNS",null,19,"15.11.0092","BANGKIT DEBI PRASETYO","FCNS"]
[20,"15.11.0040","NUGROHO TRI WIYADI","FCNS",null,20,"15.11.0095","BAGUS SUDRAJAT","FCNS"]
[21,"15.11.0044","TRI WIDIANTO","FCNS",null,21,"15.11.0097","ARIEF HIDAYAT","FCNS"]
[22,"15.11.0048","AMRI BUDI SETIAWAN","FCNS",null,22,"15.11.0099","Kartiko Wardono","FCNS"]
[23,"15.11.0049","MEGANANDA","FCNS",null,23,"15.11.0100","RAGIL SETIAWAN","FCNS"]
[24,"15.11.0050","ANDIKA YOGATAMA","FCNS",null,24,"15.11.0102","DAMAR NUR SASONGKO","FCNS"]
[25,"15.11.0051","MAJID FAJRIYAN","FCNS",null,25,"15.11.0104","EKO PRASETYO","FCNS"]
[]
[]
["Jam 12.30 s.d. 14.00 - Lab 1",{"$nulls":4},"Jam 12.30 s.d. 14.00 - Lab 7"]
["NO","NIM","NAMA","PILIHAN",null,"NO","NIM","NAMA","PILIHAN"]
[1,"15.11.0106","RAMADANI FIRDAUS","FCNS",null,1,"15.11.0138","NUGRAHANING WIDI","FCNS"]
[2,"15.11.0107","FAIZAL AJI RAMADHAN","FCNS",null,2,"15.11.0139","TRIA DONI IRAWAN","FCNS"]
[3,"15.11.0108","FAHRUL ROSI","FCNS",null,3,"15.11.0140","AGUNG NURIZAL","FCNS"]
[4,"15.11.0110","DODI SETYAWAN","FCNS",null,4,"15.11.0142","RIKI SANTOSO","FCNS"]
[5,"15.11.0111","DIAZ ADRIAN GUMINTANG","FCNS",null,5,"15.11.0144","TRI HUDA PRASETYA","FCNS"]
[6,"15.11.0112","MUHAMMAD MARUF","FCNS",null,6,"15.11.0145","INA YATUL ISNAENI","FCNS"]
[7,"15.11.0113","SITI ROUDATUL JANNAH","FCNS",null,7,"15.11.0152","IRA ARSHINTA WARDANI","FCNS"]
[8,"15.11.0114","ABDURAHMAN","FCNS",null,8,"15.11.0166","AKHMAD KHOERON FAJRI","FCNS"]
[9,"15.11.0117","LINGGA CATUR PUTRA","FCNS",null,9,"15.11.0167","FAHRUR AZIZ ROHMANUR AMIN","FCNS"]
[10,"15.11.0118","CHANDRA SETYAWAN","FCNS",null,10,"15.11.0171","ERRINA AZIZAH","FCNS"]
[11,"15.11.0119","USMAN NUR DIMAS ILHAM P","FCNS",null,11,"15.11.0173","YANWAR DWI RAMADHAN","FCNS"]
[12,"15.11.0120","NANDANA AFIF NUR FAUZI","FCNS",null,12,"15.11.0175","MAULANA IBRAHIM","FCNS"]
[13,"15.11.0121","ACHMAD ULFI","FCNS",null,13,"15.11.0176","AULIA FUAD RIFAI","FCNS"]
[14,"15.11.0122","ANDRU DITE SAPMA YOGA","FCNS",null,14,"15.11.0180","APRILIANTO AJI NUGROHO","FCNS"]
[15,"15.11.0123","MOH SOLAHUDIN","FCNS",null,15,"15.11.0184","FADHEL WIDYA RAKHMAN","FCNS"]
[16,"15.11.0125","RAFI EDU SIMBOLON","FCNS",null,16,"15.11.0186","VINA WULANDARI","FCNS"]
[17,"15.11.0126","TIKA SARI","FCNS",null,17,"15.11.0190","ABHITA BESTTIA SAGESAR","FCNS"]
[18,"15.11.0127","NUR MAYA BELLA SAFITRI","FCNS",null,18,"15.11.0191","ROLAN SAKHRULOH","FCNS"]
[19,"15.11.0128","ACHMAL MAULANA","FCNS",null,19,"15.11.0192","ALVIYAN HAPPY KURNIAWAN","FCNS"]
[20,"15.11.0129","IRKHAM MUSTOFA","FCNS",null,20,"15.11.0194","SYARIF AJI ANUGRAH","FCNS"]
[21,"15.11.0130","ASEP RAMDANI","FCNS",null,21,"15.11.0195","MUHAMMAD HAFIDZ ABDULLAH","FCNS"]
[22,"15.11.0132","DEDEN ARDIAN","FCNS",null,22,"15.11.0196","ROVI PURWANDARI","FCNS"]
[23,"15.11.0134","DIMAS WAHYU RABBANI","FCNS",null,23,"15.11.0197","VIP BRILIANT BAHARUDIN YUSUF","FCNS"]
[24,"15.11.0136","ALIF LUTHFI","FCNS",null,24,"15.11.0200","D. YULIAN RAHMAT","FCNS"]
[25,"15.11.0137","HARNI WINDIARTI","FCNS",null,25,"15.11.0201","NOVIAN ADI KUSUMO","FCNS"]
[]
[]
["Jam 14.30 s.d. 16.00 - Lab 1",{"$nulls":4},"Jam 14.30 s.d. 16.00 - Lab 7"]
["NO","NIM","NAMA","PILIHAN",null,"NO","NIM","NAMA","PILIHAN"]
[1,"15.11.0203","ANA ROFIQOH","FCNS",null,1,"15.11.0307","KUKUH PRASETYO ADHI","FCNS"]
[2,"15.11.0206","ADI PRASETIO","FCNS",null,2,"15.11.0313","KARIMA DEWI RAHMAWATI","FCNS"]
[3,"15.11.0224","REZA AGUS ADI PRATAMA","FCNS",null,3,"15.11.0327","DWI APRI ADIYANTO","FCNS"]
[4,"15.11.0225","IRVANDO DEMAS ARIFIANDANI","FCNS",null,4,"15.11.0332","FACHRIZAL ISNANDAR","FCNS"]
[5,"15.11.0232","ARIF HIDAYAT SISWANTO","FCNS",null,5,"15.11.0338","FAIQ NUR WAFDA","FCNS"]
[6,"15.11.0238","DILLA ALFIANUR KUMALASARI","FCNS",null,6,"15.12.0066","NURUL AMALIAH INTAN SAPUTRI","FCNS"]
[7,"15.11.0244","IMAM SEFUDIN","FCNS",null,7,"15.12.0068","GITA PRASTIWI","FCNS"]
[8,"15.11.0251","TATAR PANGESTU AJI","FCNS",null,8,"15.12.0107","AQNES MARIA DEWI","FCNS"]
[9,"15.11.0252","RIYANUAR NUGROHO","FCNS",null,9,"15.12.0112","JULIA INDRAWATI","FCNS"]
[10,"15.11.0254","RIZKY ARIF FAUZI","FCNS",null,10,"15.12.0119","TOMI RAMDHAN FAUZI","FCNS"]
[11,"15.11.0255","SAFKI FAJAR FATMAWAN","FCNS",null,11,"15.12.0127","AKRAL PRAMA YUDHANTO","FCNS"]
[12,"15.11.0256","ROKHANAH PUJI LESTARI","FCNS",null,12,"15.12.0143","LAILY SUHENING","FCNS"]
[13,"15.11.0257","SEPTIA DWI KURNIAWAN","FCNS",null,13,"15.12.0150","MELYANA FATMAH KARTIKASARI","FCNS"]
[14,"15.11.0259","OKY SETYAWAN","FCNS",null,14,"15.12.0155","AGUSTINA DINI ARIANI","FCNS"]
[15,"15.11.0260","DANANG CAHYO ADHI","FCNS",null,15,"15.12.0162","CICI SUNDARI","FCNS"]
[16,"15.11.0261","ADE IRMA SURYANI","FCNS",null,16,"15.12.0167","GILANG KUSUMAWARDHANA","FCNS"]
[17,"15.11.0262","GALUH DWI SAPUTRO","FCNS",null,17,"15.12.0171","MELLY SABRINAWATI","FCNS"]
[18,"15.11.0266","GESHA AGUS SETIAWAN","FCNS",null,18,"15.12.0173","RIZKI MAHANANI","FCNS"]
[19,"15.11.0267","NAUFAL DZAKY WURYANTORO","FCNS",null,19,"15.12.0180","INDRA KURNIAWAN","FCNS"]
[20,"15.11.0275","IMAN SETIAWAN","FCNS",null,20,"16.11.0015","BAGASKORO PANUNTUN","FCNS"]
[21,"15.11.0276","REGI RIPTA ASRI","FCNS",null,21,"16.11.0293","ADE HARDJO SASMITO","FCNS"]
[22,"15.11.0283","NUR AZIZ YUNIANTO","FCNS",null,22,"16.12.0010","NANDA PURWANINGSIH","FCNS"]
[23,"15.11.0289","FAFA ANWAR MUSYADAD","FCNS",null,23,"12.12.0180","CANDRA KUSUMA KURNIAWAN","FCCH"]
[24,"15.11.0291","TEGAR JUNIAR WIBOWO","FCNS",null,24,"14.12.0133","ROBBI A'TINALHIKMAH","FCCH"]
[25,"15.11.0304","MOH. INWAN BAIKUNI","FCNS",null,25,"13.11.0365","FAITHZAL IBRAHIM","FCFE"]

{"sheet":"Jadwal 2","index":1,"n_rows":43,"n_cols":12,"rows_kept":43,"merged":[[2,0,2,3]]}
["Try Out dan Ujian Sertifikasi Internasional"]
["Tanggal 2 Maret 2017 (Pelaksanaan Try Out) & 15 Maret 2017 (Pelaksanaan Ujian)"]
[]
["Jam 08.30 s.d. 10.00 - Lab 1",{"$nulls":4},"Jam 08.30 s.d. 10.00 - Lab 7"]
["NO","NIM","NAMA","PILIHAN",null,"NO","NIM","NAMA","PILIHAN"]
[1,"12.12.0157","YUDISTIRA AGUNG NUGROHO","PHOTOSHOP",null,1,"14.11.0103","AHMAD FAIZ MATLUBI","PHOTOSHOP"]
[2,"12.12.0325","ADES CHANIAGO AKMAL","PHOTOSHOP",null,2,"14.11.0220","AMALIA RACHMANIANGSIH","PHOTOSHOP"]
[3,"13.11.0203","ARIS MUNANDAR","PHOTOSHOP",null,3,"14.11.0109","AMAR ADITIA NUGROHO","PHOTOSHOP"]
[4,"13.11.0207","DIAN PUJI ASTUTI NINGRUM","PHOTOSHOP",null,4,"14.12.0029","SEKTI INDRA PRATAMA","PHOTOSHOP"]
[5,"13.11.0217","OKI RIO PAMBUDI","PHOTOSHOP",null,5,"14.11.0069","WILDAN ERWIN BACHTIAR","PHOTOSHOP",null,null," "]
[6,"14.11.0108","TAUFIK HIDAYAT NUROHMAN","PHOTOSHOP",null,6,"13.11.0270","PRADHITA MAHARANI","FLASH"]
[7,"14.11.0125","ILFA JAWAHIRIL FALAH","PHOTOSHOP",null,7,"14.11.0136","FAJAR AHMAD SUDRAJAT","FLASH"]
[8,"14.11.0126","WAHYU PRAYOGA","PHOTOSHOP",null,8,"14.11.0171","JOKO SULISTIYONO","FLASH"]
[9,"14.11.0127","THOMAS HANSANDI","PHOTOSHOP",null,9,"14.11.0218","ARIF SETIAWAN","FLASH"]
[10,"14.11.0133","MUHAMAD MARGIE APRIANSYAH","PHOTOSHOP",null,10,"14.11.0243","BRILLIANT ACHMAD","FLASH"]
[11,"14.11.0139","DIFKA WAHYU PRADANA","PHOTOSHOP",null,11,"14.12.0099","WAHYU EKO PURNOMO","FLASH"]
[12,"14.11.0149","YUSFIAN NUR FAISAL","PHOTOSHOP",null,12,"14.12.0157","FAJAR AGENG PRIYADI","FLASH"]
[13,"14.11.0177","WAHYU FEBRIYANTO","PHOTOSHOP",null,13,"14.11.0034","YOSUA SANDY GARSA","FLASH"]
[14,"14.11.0199","ALFIAN EKO YULIANTO","PHOTOSHOP",null,14,"15.11.0038","FAJAR KURNIAWAN","FLASH"]
[15,"14.11.0225","PATRIA ADHYAKSA","PHOTOSHOP",null,15,"15.12.0012","FAUZAN BAHTIAR","FLASH"]
[16,"14.11.0233","JAKT ALBARY","PHOTOSHOP",null,16,"15.12.0026","ENDIKA","FLASH"]
[17,"14.11.0253","DIMAS ADHI NUGROHO","PHOTOSHOP",null,17,"15.12.0033","NUGI INDRIYANTO","FLASH"]
[18,"14.11.0283","SHOLEHUDIN","PHOTOSHOP",null,18,"14.12.0135","ANDRIAN PRIMADITYO","FLASH"]
[19,"14.12.0119","ROY ARTURI ZENA","PHOTOSHOP",null,19]
[20,"15.11.0094","BAGUS SUMANTRI","PHOTOSHOP",null,20]
[21,"15.12.0140","WIDYA HANI FITRIYA","PHOTOSHOP",null,21]
[22,"15.12.0156","ARRINA NUR ROHMAH","PHOTOSHOP",null,22]
[23,"15.12.0170","ANITA HARYANTI","PHOTOSHOP",null,23]
[24,{"$nulls":4},24]
[25,{"$nulls":4},25]
[]
[]
["Jam 10.30 s.d. 12.00 - Lab 1"]
["NO","NIM","NAMA","PILIHAN"]
[1,"13.12.0287","ARINTA OKVIANTARI","MTA"]
[2,"14.11.0024","TUGIARTI","MTA"]
[3,"14.11.0053","WAWAN SETIAWAN","MTA"]
[4,"14.12.0040","JOHANES ALVIN PAMUNGKAS","MTA"]
[5,"14.12.0068","FANINDYA BAYU PAMBUDI","MTA"]
[6,"14.12.0118","VERA RACHMAWATI","MTA"]
[7,"14.12.0145","ULFA KHARISMAWATI","MTA"]
[8,"14.12.0146","DILA ALRESTI PUTRI","MTA"]
[9,"14.11.0230","DIAN SELVIA","MTA"]