{"text_format":"3","workbook":"xlsx","n_sheets":2,"sheets":["Sistem Informasi","Teknik Informatika"],"not_rendered":{"external_links":1,"defined_names":4},"read":"whole","date_system":"1900"}

{"sheet":"Sistem Informasi","index":0,"n_rows":48,"n_cols":8,"rows_kept":48,"merged":[[0,0,0,7]]}
["PRESENSI PENGUMPULAN YUDISIUM DAN KROSCEK NILAI IJAZAH"]
[]
["No","NIM","Nama","L / P","Prodi","Tanggal Ujian","Yudisium","Kroscek"]
[1,"11.12.2099","Abdul Ghofar Romadhon","L","SI","03 April 2017",null,"Sudah"]
[2,"12.12.0153","Achmad Rizki Nur Haerudin","L","SI","22 Maret 2017",null,"Sudah"]
[3,"11.12.2219","Adam Gita Setya Perdana","L","SI","29 Maret 2017",null,"Sudah"]
[4,"10.12.1324","Aditya Tri Anggoro","L","SI","06 April 2017"]
[5,"11.12.2199","Adwi Listiyanto","L","SI","03 April 2017",null,"Sudah"]
[6,"13.12.0066","Aisya Ika Nur Rahmawati","P","SI","08 April 2017",null,"Sudah"]
[7,"10.12.1336","Akhmad Sidiq Permana","L","SI","20 Maret 2017"]
[8,"13.12.0244","Alfhiani Kusumawigati","P","SI","01 April 2017",null,"Sudah"]
[9,"12.12.0299",{"$f":"VLOOKUP(B12,[1]MHASISWA!$A$1:$B$5450,2,0)","v":"Alifi Arman Batutta"},"L","SI","21 Maret 2017",null,"Sudah"]
[10,"11.12.2293","Allen Pradyta Sandy Cahya","L","SI","27 Maret 2017"]
[11,"13.12.0158","Alodia Rul Saffanah","P","SI","06 April 2017",null,"Sudah"]
[12,"11.12.2066","Candra Prasetyo","L","SI","20 Maret 2017"]
[13,"11.12.2196","Dahrul Abidin","L","SI","08 April 2017",null,"Sudah"]
[14,"12.12.0296","Desi Retnosari","P","SI","25 Maret 2017",null,"Sudah"]
[15,"11.12.2195","Dodi Setiyawan","L","SI","08 April 2017",null,"Sudah"]
[16,"12.12.0365","Dwi Fitriana Ariva H","P","SI","20 Maret 2017",null,"Sudah"]
[17,"12.12.0022","Dwiyan Prayoga","L","SI","29 Maret 2017",null,"Sudah"]
[18,"11.12.2294",{"$f":"VLOOKUP(B21,[1]MHASISWA!$A$1:$B$5450,2,0)","v":"Ema Rahmawati"},"P","SI","21 Maret 2017",null,"Sudah"]
[19,"12.12.0005","Fajar Kurniawan","L","SI","03 April 2017",null,"Sudah"]
[20,"12.12.0335",{"$f":"VLOOKUP(B23,[1]MHASISWA!$A$1:$B$5450,2,0)","v":"Fathur Bari"},"L","SI","31 Maret 2017",null,"Sudah"]
[21,"12.12.0179","Gigih Yuda Perdana","L","SI","25 Maret 2017",null,"Sudah"]
[22,"11.12.2251","Imam Wahyu Pratomo","L","SI","29 Maret 2017",null,"Sudah"]
[23,"11.12.2212",{"$f":"VLOOKUP(B26,[1]MHASISWA!$A$1:$B$5450,2,0)","v":"Indra Dian Kurniadi"},"L","SI","29 Maret 2017",null,"Sudah"]
[24,"12.12.0057","Koko Amru Solifudin","L","SI","03 April 2017",null,"Sudah"]
[25,"12.12.0289","Maryam Masitoh","P","SI","23 Maret 2017",null,"Sudah"]
[26,"13.12.0020",{"$f":"VLOOKUP(B29,[1]MHASISWA!$A$1:$B$5450,2,0)","v":"Mira Agustina"},"P","SI","14 Januari 2017","Sudah"]
[27,"12.12.0019","Mohammad Setiawan","L","SI","27 Maret 2017",null,"Sudah"]
[28,"11.12.2237","Nugroho Isnan","L","SI","20 Maret 2017",null,"Sudah"]
[29,"13.12.0177",{"$f":"VLOOKUP(B32,[1]MHASISWA!$A$1:$B$5450,2,0)","v":"Putri Puspitasari"},"P","SI","23 Maret 2017"]
[30,"12.12.0024","Rachmat Wahyudin","L","SI","29 Maret 2017",null,"Sudah"]
[31,"12.12.0308","Raga Sanyoto Putra","L","SI","23 Maret 2017",null,"Sudah"]
[32,"13.12.0121","Raras Sekarningtyas","P","SI","27 Maret 2017",null,"Sudah"]
[33,"12.12.0116","Rindi Fatimah","L","SI","23 Maret 2017",null,"Sudah"]
[34,"12.12.0262","Rivandy Nur Cahyo","L","SI","29 Maret 2017",null,"Sudah"]
[35,"12.12.0172",{"$f":"VLOOKUP(B38,[1]MHASISWA!$A$1:$B$5450,2,0)","v":"Rossy Leviana"},"P","SI","31 Maret 2017",null,"Sudah"]
[36,"12.12.0209","Samsudin","L","SI","23 Maret 2017",null,"Sudah"]
[37,"12.12.0270","Saputra Dewa Permata","L","SI","30 Maret 2017",null,"Sudah"]
[38,"12.12.0255","Shahnaz Elsaradia","P","SI","23 Maret 2017",null,"Sudah"]
[39,"13.12.0103","Singgih Prayitno","L","SI","04 April 2017",null,"Sudah"]
[40,"12.12.0036",{"$f":"VLOOKUP(B43,[1]MHASISWA!$A$1:$B$5450,2,0)","v":"Sismantoro"},"L","SI","06 April 2017",null,"Sudah"]
[41,"13.12.0180","Siti Toharoh","P","SI","10 April 2017"]
[42,"13.12.0215","Suciati","P","SI","03 April 2017"]
[43,"11.12.2016",{"$f":"VLOOKUP(B46,[1]MHASISWA!$A$1:$B$5450,2,0)","v":"Wisnu Broto B. U"},"L","SI","31 Maret 2017",null,"Sudah"]
[44,"13.12.0040","Wiwit Setyowati","P","SI","03 April 2017",null,"Sudah"]
[45,"12.12.0206","Yeni Trianingsih","L","SI","27 Maret 2017",null,"Sudah"]

{"sheet":"Teknik Informatika","index":1,"n_rows":72,"n_cols":8,"rows_kept":72,"merged":[[0,0,0,7]]}
["PRESENSI PENGUMPULAN YUDISIUM DAN KROSCEK NILAI IJAZAH"]
[]
["No","NIM","Nama","L / P","Prodi","Tanggal Ujian","Yudisium","Kroscek"]
[1,"13.11.0418","Abdul Rozak","L","TI","23 Maret 2017"]
[2,"11.11.2353","Ade Candra Fitrianto","L","TI","11 April 2017"]
[3,"11.11.2425",{"$f":"VLOOKUP(B6,[1]MHASISWA!$A$1:$B$5450,2,0)","v":"Aditya Eko Yudistira"},"L","TI","30 Januari 2017"]
[4,"12.11.0140","Aditya Prabowo","L","TI","06 April 2017",null,"Sudah"]
[5,"13.11.0093",{"$f":"VLOOKUP(B8,[1]MHASISWA!$A$1:$B$5450,2,0)","v":"Agnes Yulianti Sucipto"},"P","TI","01 April 2017",null,"Sudah"]
[6,"12.11.0154","Alfin Nur Aziz Saputra","L","TI","08 April 2017"]
[7,"13.11.0137","Ali Humaeni","L","TI","08 April 2017",null,"Sudah"]
[8,"12.11.0352","Andhika Wahyu Ristanto","L","TI","29 Maret 2017"]
[9,"10.11.1808","Andrea Pranatha","L","TI","25 Maret 2017",null,"Sudah"]
[10,"13.11.0395","Andri Fauzi","L","TI","10 April 2017",null,"Sudah"]
[11,"11.11.1961","Andri Firdaus","L","TI","25 Maret 2017"]
[12,"13.11.0219","Andy Haryadi","L","TI","24 Maret 2017",null,"Sudah"]
[13,"12.11.0413","Anugrah Isnan Safriono","L","TI","20 Maret 2017",null,"Sudah"]
[14,"13.11.0382","Arif Tri Wicaksono","L","TI","29 Maret 2017",null,"Sudah"]
[15,"13.11.0251","Arifin Nur Hakim Siswoyo","L","TI","30 Maret 2017",null,"Sudah"]
[16,"12.11.0165",{"$f":"VLOOKUP(B19,[1]MHASISWA!$A$1:$B$5450,2,0)","v":"Asep Probo Egiana"},"L","TI","05 April 2017",null,"Sudah"]
[17,"11.11.2390",{"$f":"VLOOKUP(B20,[1]MHASISWA!$A$1:$B$5450,2,0)","v":"Aulia Rachman"},"L","TI","21 Maret 2017"]
[18,"12.11.0167","Bakti Raharjo","L","TI","03 April 2017",null,"Sudah"]
[19,"13.11.0337","Danang Hendra Ghozali","L","TI","11 April 2017",null,"Sudah"]
[20,"11.11.2345","Danu Kurniawan","L","TI","11 April 2017"]
[21,"12.11.0112","Deny Haryono","L","TI","25 Maret 2017"]
[22,"13.11.0384","Dewi Undiaris","P","TI","05 April 2017"]
[23,"11.11.2557","Dion Sidaono","L","TI","25 Maret 2017"]
[24,"12.11.0426","Dony Prima Setiawan","L","TI","03 April 2017",null,"Sudah"]
[25,"13.11.0346","Dyah Anggraeni Hz","P","TI","31 Maret 2017",null,"Sudah"]
[26,"12.11.0155","Fadli Annas","L","TI","05 April 2017",null,"Sudah"]
[27,"11.11.2459",{"$f":"VLOOKUP(B30,[1]MHASISWA!$A$1:$B$5450,2,0)","v":"Faizin Nurdiansyah"},"L","TI","01 April 2017",null,"Sudah"]
[28,"10.11.1792","Fajar Subekti","L","TI","03 April 2017",null,"Sudah"]
[29,"13.11.0228","Feisal Rosdiana","L","TI","30 Maret 2017",null,"Sudah"]
[30,"13.11.0342","Felly Khaerunnissah","P","TI","04 April 2017",null,"Sudah"]
[31,"12.11.0442","Gigih Setya Prayoga","L","TI","11 April 2017"]
[32,"13.11.0037","Gustina Kassanova","P","TI","22 Maret 2017",null,"Sudah"]
[33,"11.11.2547","Hanna Ade Wardana","P","TI","27 Maret 2017",null,"Sudah"]
[34,"12.11.0131","Ibnu Rizka Fauzi","L","TI","27 Maret 2017",null,"Sudah"]
[35,"12.11.0080","Iskandar Agung Subekti","L","TI","20 Maret 2017",null,"Sudah"]
[36,"12.11.0180",{"$f":"VLOOKUP(B39,[1]MHASISWA!$A$1:$B$5450,2,0)","v":"Isnaeni Khanifah"},"P","TI","21 Maret 2017",null,"Sudah"]
[37,"12.11.0230",{"$f":"VLOOKUP(B40,[1]MHASISWA!$A$1:$B$5450,2,0)","v":"Janwar Widiono"},"L","TI","25 Maret 2017",null,"Sudah"]
[38,"13.11.0023",{"$f":"VLOOKUP(B41,[1]MHASISWA!$A$1:$B$5450,2,0)","v":"Kusnanto"},"L","TI","08 April 2017"]
[39,"11.11.2473","M Dimas Setiadhi","L","TI","25 Maret 2017",null,"Sudah"]
[40,"11.11.1980","Miftah Arifudin","L","TI","05 April 2017",null,"Sudah"]
[41,"11.11.2470",{"$f":"VLOOKUP(B44,[1]MHASISWA!$A$1:$B$5450,2,0)","v":"Miftakhul Bisri"},"L","TI","06 April 2017",null,"Sudah"]
[42,"12.11.0306","Mohammad Iqbal Rifai","L","TI","20 Maret 2017",null,"Sudah"]
[43,"12.11.0116","Muheni Hamam","L","TI","27 Maret 2017",null,"Sudah"]
[44,"12.11.0208","Mukhammad Nur Kholis","L","TI","27 Maret 2017"]
[45,"13.11.0220","Mustagpirin Asror","L","TI","22 Maret 2017"]
[46,"12.11.0119",{"$f":"VLOOKUP(B49,[1]MHASISWA!$A$1:$B$5450,2,0)","v":"Nanda Oka Saputra"},"L","TI","21 Maret 2017"]
[47,"13.11.0389","Ravi Aldi","L","TI","24 Maret 2017",null,"Sudah"]
[48,"11.11.2480","Ririn Tiarasona","P","TI","27 Maret 2017"]
[49,"11.11.2463",{"$f":"VLOOKUP(B52,[1]MHASISWA!$A$1:$B$5450,2,0)","v":"Riski Adi Prasojo"},"L","TI","21 Maret 2017",null,"Sudah"]
[50,"12.11.0437","Risna Setya Dewi","P","TI","30 Januari 2017","Sudah"]
[51,"13.11.0403","Rizki Haryadi","L","TI","04 April 2017",null,"Sudah"]
[52,"12.11.0256","Samsul Arifin","L","TI","29 Maret 2017",null,"Sudah"]
[53,"11.11.2413","Samuel Subagja","L","TI","29 Maret 2017",null,"Sudah"]
[54,"11.11.1996","Surono","L","TI","03 April 2017"]
[55,"12.11.0407","Susilo Aji","L","TI","25 Maret 2017"]
[56,"11.11.2320","Syarief Hidayatullah","L","TI","25 Maret 2017"]
[57,"13.11.0339","Tomi Aji Saputro","L","TI","24 Maret 2017",null,"Sudah"]
[58,"12.11.0059","Tomi Priyanto","L","TI","25 Maret 2017"]
[59,"12.11.0124",{"$f":"VLOOKUP(B62,[1]MHASISWA!$A$1:$B$5450,2,0)","v":"Urip Deadi"},"L","TI","30 Januari 2017"]
[60,"12.11.0138",{"$f":"VLOOKUP(B63,[1]MHASISWA!$A$1:$B$5450,2,0)","v":"Wahyu Irawan"},"L","TI","30 Januari 2017"]
[61,"13.11.0265",{"$f":"VLOOKUP(B64,[1]MHASISWA!$A$1:$B$5450,2,0)","v":"Wanda Prillia Budiarti"},"P","TI","05 April 2017",null,"Sudah"]
[62,"13.11.0098",{"$f":"VLOOKUP(B65,[1]MHASISWA!$A$1:$B$5450,2,0)","v":"Widya Hartayu Santoso"},"P","TI","30 Maret 2017",null,"Sudah"]
[63,"12.11.0441","Yanuar Dhega Pahlevi","L","TI","08 April 2017",null,"Sudah"]
[64,"13.11.0401",{"$f":"VLOOKUP(B67,[1]MHASISWA!$A$1:$B$5450,2,0)","v":"Yolanda Andar Pradana"},"P","TI","03 April 2017"]
[65,"13.11.0347","Yordian Antomi","L","TI","29 Maret 2017",null,"Sudah"]
[66,"12.11.0076","Zaenul Arifin","L","TI","20 Maret 2017",null,"Sudah"]
[67,"11.11.2428","Zico Risky Alfiansyah","L","TI","25 Maret 2017"]
[68,"11.11.2437",{"$f":"VLOOKUP(B71,[1]MHASISWA!$A$1:$B$5450,2,0)","v":"Zulfikar Firmansyah"},"L","TI","08 April 2017",null,"Sudah"]
[69,"12.11.0245","Zulfiqar Shertian R","L","TI","08 April 2017",null,"Sudah"]