{"text_format":"3","workbook":"xlsx","n_sheets":2,"sheets":["schedulee","Per Dosen"],"not_rendered":{"external_links":1,"defined_names":2},"read":"whole","date_system":"1900"}

{"sheet":"schedulee","index":0,"n_rows":179,"n_cols":8,"rows_kept":179,"merged":[[0,0,0,7],[1,0,1,7],[5,0,28,0],[30,0,53,0],[55,0,78,0],[80,0,103,0],[105,0,128,0],[130,0,153,0],[155,0,178,0]]}
["JADWAL PERKULIAHAN SEMESTER PENDEK STMIK AMIKOM PURWOKERTO"]
["            SEMESTER GENAP TAHUN AKADEMIK 2017/2018"]
[]
["MINGGU I"]
["HARI","RUANG","07.00-08.40","08.50-10.30","10.40-12.20","12.30-14.10","14.20-16.00","16.15-17.55"]
["Senin, 3 September","R.2.1",null,"TBI Kel 1 (Chendri)","GCC (Chendri)","Algoritma dan Struktur Data (Ito)","Implementasi dan Pengujian Perangkat Lunak (Ito)"]
[null,"R.2.2",null,"Desain dan Manajemen Bisnis (Eka)","Statistik Probabilitas (Eka)","TBI Kel 2 (Kuat)","Pembelajaran Mesin Kel 2 (Kuat)"]
[null,"R.2.3",null," SPK (Luzi)","Pemrograman .Net (Luzi)","Arsitektur dan Organisasi Komputer ( Abednego)","PV I (Andik)"]
[null,"R.2.4",null,"Aljabar Linear dan Matriks (Chyntia)","MPPL (Chyntia)","Statistik Probabilitas Kel 1 (Desty)","Aplikasi Komputer (Dwi)"]
[null,"R.3.1",null,"Sistem Operasi (Abednego)","RPL (Abednego)","Kriptografi (Imron)","Visualisasi 3D (Anugrah)"]
[null,"R.3.2",null,"Teori Graf  Kel 1 (Abdul Azis)","Pemrograman Basis Data (Abdul Azis)","Pemrograman Mobile 2 (Andik)","Interpersonal Skill (Akto)"]
[null,"R.3.3",null,"Etika Profesi SI (Akto)","Pembelajaran Mesin Kel 3 (Imron)","Seni Budaya Banyumasan (Akto)","Game Design(Aulia)"]
[null,"R.3.4",null,"CAIS (Agung)","Audit Tata Kelola TI (Agung)","Ilmu Komputasi (Agung)","Logika Matematika (Bambang)"]
[null,"R.3.5",null,"Teori Graf  Kel 2 (Adam)","Teori Graf  dan Otomata (Adam)","Multimedia 3D (Anugrah)","Pengolahan Citra Digital (Dhanar)"]
[null,"R.3.6",null,"Kecerdasan Bisnis (Andi)","E-Business (Andi)","E-Business Technology (Andi)","ERM (Fiby)"]
[null,"R.3.7",null,"Visualisasi 2D (Argiyan)","Grafika Komputer (Argiyan)","Metopel Kel 1 (Arief Adhy)","Pemrograman Game Mobile (Hellik)"]
[null,"R.3.8",null,"Logika dan Sistem Digital (Agus)","Mikroprosesor (Agus)","Multimedia (Aulia)","Semantic Web (Irfan)"]
[null,"R.3.9",null,"Teori Otomata (Bagus)","Teori Graf  Kel 3 (Bagus)","Pembelajaran Mesin Kel 1 (Bambang)"]
[null,"R.4.1",null,"PBO Kel 1 ( Debby)","Pengenalan Sistem Informasi( Debby)","Perancangan Multimedia (Dhanar)"]
[null,"R.4.2",null,"IMK (Dwi)","SIM (Dwi)","ISEP (Fiby)"]
[null,"R.4.3",null,"PBO (Gustin)","ANSBO (Gustin)","Animasi Komputer (Hellik)"]
[null,"R.4.4",null,"Representasi dan Penalaran Kel 1 (Hendra)","Bahasa Assembly (Hendra)","Pemrograman Logik dan Semantik (Irfan)"]
[null,"LAB. 1"]
[null,"LAB. 2"]
[null,"LAB. 3"]
[null,"LAB. 4"]
[null,"LAB. 5"]
[null,"LAB. 6"]
[null,"LAB. 7"]
["HARI","RUANG","07.00-08.40","08.50-10.30","10.40-12.20","12.30-14.10","14.20-16.00","16.15-17.55"]
["Selasa, 4 September","R.2.1",null,"TBI Kel 1 (Chendri)","GCC (Chendri)","Algoritma dan Struktur Data (Ito)","Implementasi dan Pengujian Perangkat Lunak (Ito)"]
[null,"R.2.2",null,"Desain dan Manajemen Bisnis (Eka)","Statistik Probabilitas (Eka)","TBI Kel 2 (Kuat)","Pembelajaran Mesin Kel 2 (Kuat)"]
[null,"R.2.3",null," SPK (Luzi)","Pemrograman .Net (Luzi)","Arsitektur dan Organisasi Komputer ( Abednego)","PV I (Andik)"]
[null,"R.2.4",null,"Aljabar Linear dan Matriks (Chyntia)","MPPL (Chyntia)","Statistik Probabilitas Kel 1 (Desty)","Aplikasi Komputer (Dwi)"]
[null,"R.3.1",null,"Sistem Operasi (Abednego)","RPL (Abednego)","Kriptografi (Imron)","Visualisasi 3D (Anugrah)"]
[null,"R.3.2",null,"Teori Graf  Kel 1 (Abdul Azis)","Pemrograman Basis Data (Abdul Azis)","Pemrograman Mobile 2 (Andik)","Interpersonal Skill (Akto)"]
[null,"R.3.3",null,"Etika Profesi SI (Akto)","Pembelajaran Mesin Kel 3 (Imron)","Seni Budaya Banyumasan (Akto)","Game Design(Aulia)"]
[null,"R.3.4",null,"CAIS (Agung)","Audit Tata Kelola TI (Agung)","Ilmu Komputasi (Agung)","Logika Matematika (Bambang)"]
[null,"R.3.5",null,"Teori Graf  Kel 2 (Adam)","Teori Graf  dan Otomata (Adam)","Multimedia 3D (Anugrah)","Pengolahan Citra Digital (Dhanar)"]
[null,"R.3.6",null,"Kecerdasan Bisnis (Andi)","E-Business (Andi)","E-Business Technology (Andi)","ERM (Fiby)"]
[null,"R.3.7",null,"Visualisasi 2D (Argiyan)","Grafika Komputer (Argiyan)","Metopel Kel 1 (Arief Adhy)","Pemrograman Game Mobile (Hellik)"]
[null,"R.3.8",null,"Logika dan Sistem Digital (Agus)","Mikroprosesor (Agus)","Multimedia (Aulia)","Semantic Web (Irfan)"]
[null,"R.3.9",null,"Teori Otomata (Bagus)","Teori Graf  Kel 3 (Bagus)","Pembelajaran Mesin Kel 1 (Bambang)"]
[null,"R.4.1",null,"PBO Kel 1 ( Debby)","Pengenalan Sistem Informasi( Debby)","Perancangan Multimedia (Dhanar)"]
[null,"R.4.2",null,"IMK (Dwi)","SIM (Dwi)","ISEP (Fiby)"]
[null,"R.4.3",null,"PBO  (Gustin)","ANSBO (Gustin)","Animasi Komputer (Hellik)"]
[null,"R.4.4",null,"Representasi dan Penalaran Kel 1 (Hendra)","Bahasa Assembly (Hendra)","Pemrograman Logik dan Semantik (Irfan)"]
[null,"LAB. 1"]
[null,"LAB. 2"]
[null,"LAB. 3"]
[null,"LAB. 4"]
[null,"LAB. 5"]
[null,"LAB. 6"]
[null,"LAB. 7"]
["HARI","RUANG","07.00-08.40","08.50-10.30","10.40-12.20","12.30-14.10","14.20-16.00","16.15-17.55"]
["Rabu, 5 September","R.2.1",null,"TBI Kel 1 (Chendri)","GCC (Chendri)","Algoritma dan Struktur Data (Ito)","Implementasi dan Pengujian Perangkat Lunak (Ito)"]
[null,"R.2.2",null,"Desain dan Manajemen Bisnis (Eka)","Statistik Probabilitas (Eka)","TBI Kel 2 (Kuat)","Pembelajaran Mesin Kel 2 (Kuat)"]
[null,"R.2.3",null," SPK (Luzi)","Pemrograman .Net (Luzi)","Arsitektur dan Organisasi Komputer ( Abednego)","PV I (Andik)"]
[null,"R.2.4",null,"Aljabar Linear dan Matriks (Chyntia)","MPPL (Chyntia)","Statistik Probabilitas Kel 1 (Desty)","Aplikasi Komputer (Dwi)"]
[null,"R.3.1",null,"Sistem Operasi (Abednego)","RPL (Abednego)","Kriptografi (Imron)","Visualisasi 3D (Anugrah)"]
[null,"R.3.2",null,"Teori Graf  Kel 1 (Abdul Azis)","Pemrograman Basis Data (Abdul Azis)","Pemrograman Mobile 2 (Andik)","Interpersonal Skill (Akto)"]
[null,"R.3.3",null,"Etika Profesi SI (Akto)","Pembelajaran Mesin Kel 3 (Imron)","Seni Budaya Banyumasan (Akto)","Game Design(Aulia)"]
[null,"R.3.4",null,"CAIS (Agung)","Audit Tata Kelola TI (Agung)","Ilmu Komputasi (Agung)","Logika Matematika (Bambang)"]
[null,"R.3.5",null,"Teori Graf  Kel 2 (Adam)","Teori Graf  dan Otomata (Adam)","Multimedia 3D (Anugrah)","Pengolahan Citra Digital (Dhanar)"]
[null,"R.3.6",null,"Kecerdasan Bisnis (Andi)","E-Business (Andi)","E-Business Technology (Andi)","ERM (Fiby)"]
[null,"R.3.7",null,"Visualisasi 2D (Argiyan)","Grafika Komputer (Argiyan)","Metopel Kel 1 (Arief Adhy)","Pemrograman Game Mobile (Hellik)"]
[null,"R.3.8",null,"Logika dan Sistem Digital (Agus)","Mikroprosesor (Agus)","Multimedia (Aulia)","Semantic Web (Irfan)"]
[null,"R.3.9",null,"Teori Otomata (Bagus)","Teori Graf  Kel 3 (Bagus)","Pembelajaran Mesin Kel 1 (Bambang)"]
[null,"R.4.1",null,"PBO Kel 1 ( Debby)","Pengenalan Sistem Informasi( Debby)","Perancangan Multimedia (Dhanar)"]
[null,"R.4.2",null,"IMK (Dwi)","SIM (Dwi)","ISEP (Fiby)"]
[null,"R.4.3",null,"PBO  (Gustin)","ANSBO (Gustin)","Animasi Komputer (Hellik)"]
[null,"R.4.4",null,"Representasi dan Penalaran Kel 1 (Hendra)","Bahasa Assembly (Hendra)","Pemrograman Logik dan Semantik (Irfan)"]
[null,"LAB. 1"]
[null,"LAB. 2"]
[null,"LAB. 3"]
[null,"LAB. 4"]
[null,"LAB. 5"]
[null,"LAB. 6"]
[null,"LAB. 7"]
["HARI","RUANG","07.00-08.40","08.50-10.30","10.40-12.20","12.30-14.10","14.20-16.00","16.15-17.55"]
{"$rows_left_out":100}
{"sheet":"Per Dosen","index":1,"n_rows":259,"n_cols":7,"rows_kept":259,"merged":[[0,0,0,6],[4,1,6,1],[9,1,11,1],[13,1,15,1],[20,1,22,1],[24,1,25,1],[28,1,29,1],[30,1,34,1],[35,1,36,1],[39,1,40,1],[47,1,48,1],[55,1,56,1],[59,1,60,1],[63,1,66,1],[67,1,69,1],[73,1,75,1],[76,1,78,1],[80,1,82,1],[85,1,87,1],[90,1,91,1],[99,1,101,1],[105,1,106,1],[107,1,108,1],[119,1,121,1],[123,1,124,1],[125,1,127,1],[130,1,131,1],[136,1,138,1],[139,1,140,1],[149,1,150,1],[152,1,153,1],[156,1,157,1],[158,1,160,1],[167,1,170,1],[174,1,176,1],[178,1,180,1],[189,1,190,1],[200,1,203,1],[208,1,209,1],[212,1,215,1],[219,1,220,1],[223,1,226,1],[228,1,229,1],[231,1,232,1],[235,1,236,1],[240,1,241,1],[243,1,246,1],[248,1,249,1]]}
["Rekap SP Semester Genap 2018"]
[]
["No","Nama Dosen","Kode","Mata Kuliah","SKS","Semester","Ket"]
[1,"Sarmini, S.Kom., M.MSI ","SI201",{"$f":"IF(C4=\"\",\"\",VLOOKUP(C4,[1]Matkul!$A$2:$B$332,2,0))","v":"Algoritma dan Pemrograman"},{"$f":"IF(C4=\"\",\"\",VLOOKUP(C4,[1]Matkul!$A$2:$C$332,3,0))","v":4},{"$f":"IF(C4=\"\",\"\",VLOOKUP(C4,[1]Matkul!$A$2:$D$332,4,0))","v":1}]
[null,"Sarmini, S.Kom., M.MSI ","SI208",{"$f":"IF(C5=\"\",\"\",VLOOKUP(C5,[1]Matkul!$A$2:$B$332,2,0))","v":"Analisis dan Desain Sistem Informasi"},{"$f":"IF(C5=\"\",\"\",VLOOKUP(C5,[1]Matkul!$A$2:$C$332,3,0))","v":4},{"$f":"IF(C5=\"\",\"\",VLOOKUP(C5,[1]Matkul!$A$2:$D$332,4,0))","v":2}]
[null,null,"SI104",{"$f":"IF(C6=\"\",\"\",VLOOKUP(C6,[1]Matkul!$A$2:$B$332,2,0))","v":"Analisis dan Desain Sistem Informasi"},{"$f":"IF(C6=\"\",\"\",VLOOKUP(C6,[1]Matkul!$A$2:$C$332,3,0))","v":4},{"$f":"IF(C6=\"\",\"\",VLOOKUP(C6,[1]Matkul!$A$2:$D$332,4,0))","v":1}]
[null,null,"SI045",{"$f":"IF(C7=\"\",\"\",VLOOKUP(C7,[1]Matkul!$A$2:$B$332,2,0))","v":"Analisis Kinerja Sistem"},{"$f":"IF(C7=\"\",\"\",VLOOKUP(C7,[1]Matkul!$A$2:$C$332,3,0))","v":2},{"$f":"IF(C7=\"\",\"\",VLOOKUP(C7,[1]Matkul!$A$2:$D$332,4,0))","v":6}]
[]
[2,"Ito Setiawan, S.Kom, M.MSI","SI235",{"$f":"IF(C9=\"\",\"\",VLOOKUP(C9,[1]Matkul!$A$2:$B$332,2,0))","v":"Implementasi dan Pengujian Perangkat Lunak"},{"$f":"IF(C9=\"\",\"\",VLOOKUP(C9,[1]Matkul!$A$2:$C$332,3,0))","v":3},{"$f":"IF(C9=\"\",\"\",VLOOKUP(C9,[1]Matkul!$A$2:$D$332,4,0))","v":6}]
[null,"Ito Setiawan, S.Kom, M.MSI","TI006",{"$f":"IF(C10=\"\",\"\",VLOOKUP(C10,[1]Matkul!$A$2:$B$332,2,0))","v":"Algoritma dan Struktur Data"},{"$f":"IF(C10=\"\",\"\",VLOOKUP(C10,[1]Matkul!$A$2:$C$332,3,0))","v":4},{"$f":"IF(C10=\"\",\"\",VLOOKUP(C10,[1]Matkul!$A$2:$D$332,4,0))","v":1}]
[null,null,"IF106",{"$f":"IF(C11=\"\",\"\",VLOOKUP(C11,[1]Matkul!$A$2:$B$332,2,0))","v":"Algoritma dan Struktur Data"},{"$f":"IF(C11=\"\",\"\",VLOOKUP(C11,[1]Matkul!$A$2:$C$332,3,0))","v":3},{"$f":"IF(C11=\"\",\"\",VLOOKUP(C11,[1]Matkul!$A$2:$D$332,4,0))","v":1}]
[null,null,"SI101",{"$f":"IF(C12=\"\",\"\",VLOOKUP(C12,[1]Matkul!$A$2:$B$332,2,0))","v":"Algoritma dan Struktur Data"},{"$f":"IF(C12=\"\",\"\",VLOOKUP(C12,[1]Matkul!$A$2:$C$332,3,0))","v":4},{"$f":"IF(C12=\"\",\"\",VLOOKUP(C12,[1]Matkul!$A$2:$D$332,4,0))","v":1}]
[]
[3,"Chyntia Raras Ajeng W, S.Kom., M.Eng.","SI211",{"$f":"IF(C14=\"\",\"\",VLOOKUP(C14,[1]Matkul!$A$2:$B$332,2,0))","v":"Aljabar Linear dan Matriks"},{"$f":"IF(C14=\"\",\"\",VLOOKUP(C14,[1]Matkul!$A$2:$C$332,3,0))","v":2},{"$f":"IF(C14=\"\",\"\",VLOOKUP(C14,[1]Matkul!$A$2:$D$332,4,0))","v":2}]
[null,null,"SI128",{"$f":"IF(C15=\"\",\"\",VLOOKUP(C15,[1]Matkul!$A$2:$B$332,2,0))","v":"Aljabar Liniear dan Matriks"},{"$f":"IF(C15=\"\",\"\",VLOOKUP(C15,[1]Matkul!$A$2:$C$332,3,0))","v":2},{"$f":"IF(C15=\"\",\"\",VLOOKUP(C15,[1]Matkul!$A$2:$D$332,4,0))","v":4}]
[null,null,"IF113",{"$f":"IF(C16=\"\",\"\",VLOOKUP(C16,[1]Matkul!$A$2:$B$332,2,0))","v":"Aljabar Linier"},{"$f":"IF(C16=\"\",\"\",VLOOKUP(C16,[1]Matkul!$A$2:$C$332,3,0))","v":3},{"$f":"IF(C16=\"\",\"\",VLOOKUP(C16,[1]Matkul!$A$2:$D$332,4,0))","v":2}]
[null,"Chyntia Raras Ajeng W, S.Kom., M.Eng.","TI033",{"$f":"IF(C17=\"\",\"\",VLOOKUP(C17,[1]Matkul!$A$2:$B$332,2,0))","v":"Metode Pengembangan Perangkat Lunak"},{"$f":"IF(C17=\"\",\"\",VLOOKUP(C17,[1]Matkul!$A$2:$C$332,3,0))","v":3},{"$f":"IF(C17=\"\",\"\",VLOOKUP(C17,[1]Matkul!$A$2:$D$332,4,0))","v":5}]
[null,null,"IF130",{"$f":"IF(C18=\"\",\"\",VLOOKUP(C18,[1]Matkul!$A$2:$B$332,2,0))","v":"Metode Pengembangan Perangkat Lunak"},{"$f":"IF(C18=\"\",\"\",VLOOKUP(C18,[1]Matkul!$A$2:$C$332,3,0))","v":3},{"$f":"IF(C18=\"\",\"\",VLOOKUP(C18,[1]Matkul!$A$2:$D$332,4,0))","v":5}]
[]
[4,"Gustin Setyaningsih, S.Kom.,M.MSI","SI111",{"$f":"IF(C20=\"\",\"\",VLOOKUP(C20,[1]Matkul!$A$2:$B$332,2,0))","v":"Analisa Dan Desain Sistem Berorientasi Objek"},{"$f":"IF(C20=\"\",\"\",VLOOKUP(C20,[1]Matkul!$A$2:$C$332,3,0))","v":3},{"$f":"IF(C20=\"\",\"\",VLOOKUP(C20,[1]Matkul!$A$2:$D$332,4,0))","v":2}]
[null,"Gustin Setyaningsih, S.Kom.,M.MSI","TI009",{"$f":"IF(C21=\"\",\"\",VLOOKUP(C21,[1]Matkul!$A$2:$B$332,2,0))","v":"Pemrograman Berorientasi Objek"},{"$f":"IF(C21=\"\",\"\",VLOOKUP(C21,[1]Matkul!$A$2:$C$332,3,0))","v":4},{"$f":"IF(C21=\"\",\"\",VLOOKUP(C21,[1]Matkul!$A$2:$D$332,4,0))","v":2}]
[null,null,"SI112",{"$f":"IF(C22=\"\",\"\",VLOOKUP(C22,[1]Matkul!$A$2:$B$332,2,0))","v":"Pemrograman Berorientasi Objek"},{"$f":"IF(C22=\"\",\"\",VLOOKUP(C22,[1]Matkul!$A$2:$C$332,3,0))","v":3},{"$f":"IF(C22=\"\",\"\",VLOOKUP(C22,[1]Matkul!$A$2:$D$332,4,0))","v":2}]
[null,null,"SI214",{"$f":"IF(C23=\"\",\"\",VLOOKUP(C23,[1]Matkul!$A$2:$B$332,2,0))","v":"Pemrograman Berorientasi Objek"},{"$f":"IF(C23=\"\",\"\",VLOOKUP(C23,[1]Matkul!$A$2:$C$332,3,0))","v":3},{"$f":"IF(C23=\"\",\"\",VLOOKUP(C23,[1]Matkul!$A$2:$D$332,4,0))","v":3}]
[]
[5,"Hellik Hermawan, M. Kom.","TI055",{"$f":"IF(C25=\"\",\"\",VLOOKUP(C25,[1]Matkul!$A$2:$B$332,2,0))","v":"Animasi Komputer"},{"$f":"IF(C25=\"\",\"\",VLOOKUP(C25,[1]Matkul!$A$2:$C$332,3,0))","v":4},{"$f":"IF(C25=\"\",\"\",VLOOKUP(C25,[1]Matkul!$A$2:$D$332,4,0))","v":6}]
[null,null,"IF150",{"$f":"IF(C26=\"\",\"\",VLOOKUP(C26,[1]Matkul!$A$2:$B$332,2,0))","v":"Animasi Komputer"},{"$f":"IF(C26=\"\",\"\",VLOOKUP(C26,[1]Matkul!$A$2:$C$332,3,0))","v":4},{"$f":"IF(C26=\"\",\"\",VLOOKUP(C26,[1]Matkul!$A$2:$D$332,4,0))","v":6}]
[null,"Hellik Hermawan, M. Kom.","IF148",{"$f":"IF(C27=\"\",\"\",VLOOKUP(C27,[1]Matkul!$A$2:$B$332,2,0))","v":"Pemrograman Game Mobile"},{"$f":"IF(C27=\"\",\"\",VLOOKUP(C27,[1]Matkul!$A$2:$C$332,3,0))","v":4},{"$f":"IF(C27=\"\",\"\",VLOOKUP(C27,[1]Matkul!$A$2:$D$332,4,0))","v":6}]
[]
[6,"Dwi Krisbiantoro, M.Kom.","SI207",{"$f":"IF(C29=\"\",\"\",VLOOKUP(C29,[1]Matkul!$A$2:$B$332,2,0))","v":"Aplikasi Komputer"},{"$f":"IF(C29=\"\",\"\",VLOOKUP(C29,[1]Matkul!$A$2:$C$332,3,0))","v":3},{"$f":"IF(C29=\"\",\"\",VLOOKUP(C29,[1]Matkul!$A$2:$D$332,4,0))","v":1}]
[null,null,"SI107",{"$f":"IF(C30=\"\",\"\",VLOOKUP(C30,[1]Matkul!$A$2:$B$332,2,0))","v":"Aplikasi Komputer"},{"$f":"IF(C30=\"\",\"\",VLOOKUP(C30,[1]Matkul!$A$2:$C$332,3,0))","v":3},{"$f":"IF(C30=\"\",\"\",VLOOKUP(C30,[1]Matkul!$A$2:$D$332,4,0))","v":1}]
[null,"Dwi Krisbiantoro, M.Kom.","SI222",{"$f":"IF(C31=\"\",\"\",VLOOKUP(C31,[1]Matkul!$A$2:$B$332,2,0))","v":"Interaksi Manusia dan Komputer"},{"$f":"IF(C31=\"\",\"\",VLOOKUP(C31,[1]Matkul!$A$2:$C$332,3,0))","v":3},{"$f":"IF(C31=\"\",\"\",VLOOKUP(C31,[1]Matkul!$A$2:$D$332,4,0))","v":4}]
[null,null,"ST046",{"$f":"IF(C32=\"\",\"\",VLOOKUP(C32,[1]Matkul!$A$2:$B$332,2,0))","v":"Interaksi Manusia dan Komputer"},{"$f":"IF(C32=\"\",\"\",VLOOKUP(C32,[1]Matkul!$A$2:$C$332,3,0))","v":2},{"$f":"IF(C32=\"\",\"\",VLOOKUP(C32,[1]Matkul!$A$2:$D$332,4,0))","v":6}]
[null,null,"IF128",{"$f":"IF(C33=\"\",\"\",VLOOKUP(C33,[1]Matkul!$A$2:$B$332,2,0))","v":"Interaksi Manusia dan Komputer"},{"$f":"IF(C33=\"\",\"\",VLOOKUP(C33,[1]Matkul!$A$2:$C$332,3,0))","v":2},{"$f":"IF(C33=\"\",\"\",VLOOKUP(C33,[1]Matkul!$A$2:$D$332,4,0))","v":5}]
[null,null,"TI031",{"$f":"IF(C34=\"\",\"\",VLOOKUP(C34,[1]Matkul!$A$2:$B$332,2,0))","v":"Interaksi Manusia dan Komputer"},{"$f":"IF(C34=\"\",\"\",VLOOKUP(C34,[1]Matkul!$A$2:$C$332,3,0))","v":2},{"$f":"IF(C34=\"\",\"\",VLOOKUP(C34,[1]Matkul!$A$2:$D$332,4,0))","v":5}]
[null,null,"SI122",{"$f":"IF(C35=\"\",\"\",VLOOKUP(C35,[1]Matkul!$A$2:$B$332,2,0))","v":"Interaksi Manusia dan Komputer"},{"$f":"IF(C35=\"\",\"\",VLOOKUP(C35,[1]Matkul!$A$2:$C$332,3,0))","v":3},{"$f":"IF(C35=\"\",\"\",VLOOKUP(C35,[1]Matkul!$A$2:$D$332,4,0))","v":4}]
[null,"Dwi Krisbiantoro, M.Kom.","TI042",{"$f":"IF(C36=\"\",\"\",VLOOKUP(C36,[1]Matkul!$A$2:$B$332,2,0))","v":"Sistem Informasi Manajemen"},{"$f":"IF(C36=\"\",\"\",VLOOKUP(C36,[1]Matkul!$A$2:$C$332,3,0))","v":2},{"$f":"IF(C36=\"\",\"\",VLOOKUP(C36,[1]Matkul!$A$2:$D$332,4,0))","v":6}]
[null,null,"SI121",{"$f":"IF(C37=\"\",\"\",VLOOKUP(C37,[1]Matkul!$A$2:$B$332,2,0))","v":"Sistem Informasi Manajemen"},{"$f":"IF(C37=\"\",\"\",VLOOKUP(C37,[1]Matkul!$A$2:$C$332,3,0))","v":3},{"$f":"IF(C37=\"\",\"\",VLOOKUP(C37,[1]Matkul!$A$2:$D$332,4,0))","v":3}]
[]
[7,"Abednego Dwi Septiadi, M.Kom. ","IF107",{"$f":"IF(C39=\"\",\"\",VLOOKUP(C39,[1]Matkul!$A$2:$B$332,2,0))","v":"Arsitektur dan Organisasi Komputer"},{"$f":"IF(C39=\"\",\"\",VLOOKUP(C39,[1]Matkul!$A$2:$C$332,3,0))","v":3},{"$f":"IF(C39=\"\",\"\",VLOOKUP(C39,[1]Matkul!$A$2:$D$332,4,0))","v":1}]
[null,"Abednego Dwi Septiadi, M.Kom. ","TI027",{"$f":"IF(C40=\"\",\"\",VLOOKUP(C40,[1]Matkul!$A$2:$B$332,2,0))","v":"Rekayasa Perangkat Lunak"},{"$f":"IF(C40=\"\",\"\",VLOOKUP(C40,[1]Matkul!$A$2:$C$332,3,0))","v":2},{"$f":"IF(C40=\"\",\"\",VLOOKUP(C40,[1]Matkul!$A$2:$D$332,4,0))","v":4}]
[null,null,"IF125",{"$f":"IF(C41=\"\",\"\",VLOOKUP(C41,[1]Matkul!$A$2:$B$332,2,0))","v":"Rekayasa Perangkat Lunak"},{"$f":"IF(C41=\"\",\"\",VLOOKUP(C41,[1]Matkul!$A$2:$C$332,3,0))","v":2},{"$f":"IF(C41=\"\",\"\",VLOOKUP(C41,[1]Matkul!$A$2:$D$332,4,0))","v":4}]
[null,"Abednego Dwi Septiadi, M.Kom. ","SI210",{"$f":"IF(C42=\"\",\"\",VLOOKUP(C42,[1]Matkul!$A$2:$B$332,2,0))","v":"Sistem Operasi"},{"$f":"IF(C42=\"\",\"\",VLOOKUP(C42,[1]Matkul!$A$2:$C$332,3,0))","v":3},{"$f":"IF(C42=\"\",\"\",VLOOKUP(C42,[1]Matkul!$A$2:$D$332,4,0))","v":2},"Kel 1"]
[]
[8,"Tarwoto, S.Kom., M.MSI ","SI231",{"$f":"IF(C44=\"\",\"\",VLOOKUP(C44,[1]Matkul!$A$2:$B$332,2,0))","v":"Arsitektur Enterprise"},{"$f":"IF(C44=\"\",\"\",VLOOKUP(C44,[1]Matkul!$A$2:$C$332,3,0))","v":3},{"$f":"IF(C44=\"\",\"\",VLOOKUP(C44,[1]Matkul!$A$2:$D$332,4,0))","v":6}]
[null,"Tarwoto, S.Kom., M.MSI ","IF111",{"$f":"IF(C45=\"\",\"\",VLOOKUP(C45,[1]Matkul!$A$2:$B$332,2,0))","v":"Representasi dan Penalaran"},{"$f":"IF(C45=\"\",\"\",VLOOKUP(C45,[1]Matkul!$A$2:$C$332,3,0))","v":3},{"$f":"IF(C45=\"\",\"\",VLOOKUP(C45,[1]Matkul!$A$2:$D$332,4,0))","v":2},"Kel 2"]
[]
[9,"Muhamad Awiet W P, S.Kom, M.MSI","TI036",{"$f":"IF(C47=\"\",\"\",VLOOKUP(C47,[1]Matkul!$A$2:$B$332,2,0))","v":"Arsitektur Keamanan & Sistem Administrator"},{"$f":"IF(C47=\"\",\"\",VLOOKUP(C47,[1]Matkul!$A$2:$C$332,3,0))","v":3},{"$f":"IF(C47=\"\",\"\",VLOOKUP(C47,[1]Matkul!$A$2:$D$332,4,0))","v":5}]
[null,"Muhamad Awiet W P, S.Kom, M.MSI","IF133",{"$f":"IF(C48=\"\",\"\",VLOOKUP(C48,[1]Matkul!$A$2:$B$332,2,0))","v":"Keamanan Informasi dan Jaringan"},{"$f":"IF(C48=\"\",\"\",VLOOKUP(C48,[1]Matkul!$A$2:$C$332,3,0))","v":3},{"$f":"IF(C48=\"\",\"\",VLOOKUP(C48,[1]Matkul!$A$2:$D$332,4,0))","v":5}]
[null,null,"TI021",{"$f":"IF(C49=\"\",\"\",VLOOKUP(C49,[1]Matkul!$A$2:$B$332,2,0))","v":"Keamanan Jaringan"},{"$f":"IF(C49=\"\",\"\",VLOOKUP(C49,[1]Matkul!$A$2:$C$332,3,0))","v":2},{"$f":"IF(C49=\"\",\"\",VLOOKUP(C49,[1]Matkul!$A$2:$D$332,4,0))","v":3}]
[null,"Muhamad Awiet W P, S.Kom, M.MSI","SI244",{"$f":"IF(C50=\"\",\"\",VLOOKUP(C50,[1]Matkul!$A$2:$B$332,2,0))","v":"Tata Kelola Teknologi Informasi"},{"$f":"IF(C50=\"\",\"\",VLOOKUP(C50,[1]Matkul!$A$2:$C$332,3,0))","v":3},{"$f":"IF(C50=\"\",\"\",VLOOKUP(C50,[1]Matkul!$A$2:$D$332,4,0))","v":6}]
[]
[10,"Agung Prasetyo, M.Kom ","TI045",{"$f":"IF(C52=\"\",\"\",VLOOKUP(C52,[1]Matkul!$A$2:$B$332,2,0))","v":"Audit Tata Kelola IT"},{"$f":"IF(C52=\"\",\"\",VLOOKUP(C52,[1]Matkul!$A$2:$C$332,3,0))","v":2},{"$f":"IF(C52=\"\",\"\",VLOOKUP(C52,[1]Matkul!$A$2:$D$332,4,0))","v":7}]
[null,"Agung Prasetyo, M.Kom ","SI139",{"$f":"IF(C53=\"\",\"\",VLOOKUP(C53,[1]Matkul!$A$2:$B$332,2,0))","v":"Controlling and Auditing Information System"},{"$f":"IF(C53=\"\",\"\",VLOOKUP(C53,[1]Matkul!$A$2:$C$332,3,0))","v":3},{"$f":"IF(C53=\"\",\"\",VLOOKUP(C53,[1]Matkul!$A$2:$D$332,4,0))","v":6}]
[null,"Agung Prasetyo, M.Kom ","TI018",{"$f":"IF(C54=\"\",\"\",VLOOKUP(C54,[1]Matkul!$A$2:$B$332,2,0))","v":"Ilmu Komputasi"},{"$f":"IF(C54=\"\",\"\",VLOOKUP(C54,[1]Matkul!$A$2:$C$332,3,0))","v":4},{"$f":"IF(C54=\"\",\"\",VLOOKUP(C54,[1]Matkul!$A$2:$D$332,4,0))","v":3}]
[]
[11,"Hendra Marcos, S.T., M.Eng. ","IF122",{"$f":"IF(C56=\"\",\"\",VLOOKUP(C56,[1]Matkul!$A$2:$B$332,2,0))","v":"Bahasa Assembly"},{"$f":"IF(C56=\"\",\"\",VLOOKUP(C56,[1]Matkul!$A$2:$C$332,3,0))","v":3},{"$f":"IF(C56=\"\",\"\",VLOOKUP(C56,[1]Matkul!$A$2:$D$332,4,0))","v":4}]
[null,null,"TI011",{"$f":"IF(C57=\"\",\"\",VLOOKUP(C57,[1]Matkul!$A$2:$B$332,2,0))","v":"Bahasa Assembly"},{"$f":"IF(C57=\"\",\"\",VLOOKUP(C57,[1]Matkul!$A$2:$C$332,3,0))","v":3},{"$f":"IF(C57=\"\",\"\",VLOOKUP(C57,[1]Matkul!$A$2:$D$332,4,0))","v":2}]
[null,"Hendra Marcos, S.T., M.Eng. ","IF111",{"$f":"IF(C58=\"\",\"\",VLOOKUP(C58,[1]Matkul!$A$2:$B$332,2,0))","v":"Representasi dan Penalaran"},{"$f":"IF(C58=\"\",\"\",VLOOKUP(C58,[1]Matkul!$A$2:$C$332,3,0))","v":3},{"$f":"IF(C58=\"\",\"\",VLOOKUP(C58,[1]Matkul!$A$2:$D$332,4,0))","v":2},"Kel 1"]
[]
[12,"Muliasari Pinilih, SE, M. Si.","TI039",{"$f":"IF(C60=\"\",\"\",VLOOKUP(C60,[1]Matkul!$A$2:$B$332,2,0))","v":"Bahasa Indonesia"},{"$f":"IF(C60=\"\",\"\",VLOOKUP(C60,[1]Matkul!$A$2:$C$332,3,0))","v":2},{"$f":"IF(C60=\"\",\"\",VLOOKUP(C60,[1]Matkul!$A$2:$D$332,4,0))","v":6}]
[null,null,"AP201",{"$f":"IF(C61=\"\",\"\",VLOOKUP(C61,[1]Matkul!$A$2:$B$332,2,0))","v":"Bahasa Indonesia"},{"$f":"IF(C61=\"\",\"\",VLOOKUP(C61,[1]Matkul!$A$2:$C$332,3,0))","v":3},{"$f":"IF(C61=\"\",\"\",VLOOKUP(C61,[1]Matkul!$A$2:$D$332,4,0))","v":2}]
[null,"Muliasari Pinilih, SE, M. Si.","IF110",{"$f":"IF(C62=\"\",\"\",VLOOKUP(C62,[1]Matkul!$A$2:$B$332,2,0))","v":"Statistik Probabilitas"},{"$f":"IF(C62=\"\",\"\",VLOOKUP(C62,[1]Matkul!$A$2:$C$332,3,0))","v":3},{"$f":"IF(C62=\"\",\"\",VLOOKUP(C62,[1]Matkul!$A$2:$D$332,4,0))","v":2},"Kel 2"]
[]
[13,"Zulia Karini, S.S., M.Hum.","SI146",{"$f":"IF(C64=\"\",\"\",VLOOKUP(C64,[1]Matkul!$A$2:$B$332,2,0))","v":"Bahasa Inggris"},{"$f":"IF(C64=\"\",\"\",VLOOKUP(C64,[1]Matkul!$A$2:$C$332,3,0))","v":2},{"$f":"IF(C64=\"\",\"\",VLOOKUP(C64,[1]Matkul!$A$2:$D$332,4,0))","v":6}]
[null,null,"SI219",{"$f":"IF(C65=\"\",\"\",VLOOKUP(C65,[1]Matkul!$A$2:$B$332,2,0))","v":"Bahasa Inggris 1"},{"$f":"IF(C65=\"\",\"\",VLOOKUP(C65,[1]Matkul!$A$2:$C$332,3,0))","v":2},{"$f":"IF(C65=\"\",\"\",VLOOKUP(C65,[1]Matkul!$A$2:$D$332,4,0))","v":3}]
[null,null,"TI023",{"$f":"IF(C66=\"\",\"\",VLOOKUP(C66,[1]Matkul!$A$2:$B$332,2,0))","v":"Bahasa Inggris I"},{"$f":"IF(C66=\"\",\"\",VLOOKUP(C66,[1]Matkul!$A$2:$C$332,3,0))","v":2},{"$f":"IF(C66=\"\",\"\",VLOOKUP(C66,[1]Matkul!$A$2:$D$332,4,0))","v":3}]
[null,null,"IF101",{"$f":"IF(C67=\"\",\"\",VLOOKUP(C67,[1]Matkul!$A$2:$B$332,2,0))","v":"Bahasa Inggris I"},{"$f":"IF(C67=\"\",\"\",VLOOKUP(C67,[1]Matkul!$A$2:$C$332,3,0))","v":2},{"$f":"IF(C67=\"\",\"\",VLOOKUP(C67,[1]Matkul!$A$2:$D$332,4,0))","v":3}]
[null,"Zulia Karini, S.S., M.Hum.","TI028",{"$f":"IF(C68=\"\",\"\",VLOOKUP(C68,[1]Matkul!$A$2:$B$332,2,0))","v":"Bahasa Inggris II"},{"$f":"IF(C68=\"\",\"\",VLOOKUP(C68,[1]Matkul!$A$2:$C$332,3,0))","v":2},{"$f":"IF(C68=\"\",\"\",VLOOKUP(C68,[1]Matkul!$A$2:$D$332,4,0))","v":4}]
[null,null,"IF102",{"$f":"IF(C69=\"\",\"\",VLOOKUP(C69,[1]Matkul!$A$2:$B$332,2,0))","v":"Bahasa Inggris II"},{"$f":"IF(C69=\"\",\"\",VLOOKUP(C69,[1]Matkul!$A$2:$C$332,3,0))","v":2},{"$f":"IF(C69=\"\",\"\",VLOOKUP(C69,[1]Matkul!$A$2:$D$332,4,0))","v":4}]
[null,null,"SI224",{"$f":"IF(C70=\"\",\"\",VLOOKUP(C70,[1]Matkul!$A$2:$B$332,2,0))","v":"Bahasa Inggris 2"},{"$f":"IF(C70=\"\",\"\",VLOOKUP(C70,[1]Matkul!$A$2:$C$332,3,0))","v":2},{"$f":"IF(C70=\"\",\"\",VLOOKUP(C70,[1]Matkul!$A$2:$D$332,4,0))","v":4}]
[]
[14,"Taqwa Hari Guna, S.T., M.Kom., Dr.","IF131",{"$f":"IF(C72=\"\",\"\",VLOOKUP(C72,[1]Matkul!$A$2:$B$332,2,0))","v":"Cloud Computing"},{"$f":"IF(C72=\"\",\"\",VLOOKUP(C72,[1]Matkul!$A$2:$C$332,3,0))","v":2},{"$f":"IF(C72=\"\",\"\",VLOOKUP(C72,[1]Matkul!$A$2:$D$332,4,0))","v":5}]
[null,"Taqwa Hari Guna, S.T., M.Kom., Dr.","SI217",{"$f":"IF(C73=\"\",\"\",VLOOKUP(C73,[1]Matkul!$A$2:$B$332,2,0))","v":"Dasar-dasar Pengembangan Perangkat Lunak"},{"$f":"IF(C73=\"\",\"\",VLOOKUP(C73,[1]Matkul!$A$2:$C$332,3,0))","v":3},{"$f":"IF(C73=\"\",\"\",VLOOKUP(C73,[1]Matkul!$A$2:$D$332,4,0))","v":3}]
[null,"Taqwa Hari Guna, S.T., M.Kom., Dr.","IF121",{"$f":"IF(C74=\"\",\"\",VLOOKUP(C74,[1]Matkul!$A$2:$B$332,2,0))","v":"Pendidikan Anti Korupsi"},{"$f":"IF(C74=\"\",\"\",VLOOKUP(C74,[1]Matkul!$A$2:$C$332,3,0))","v":2},{"$f":"IF(C74=\"\",\"\",VLOOKUP(C74,[1]Matkul!$A$2:$D$332,4,0))","v":3}]
[null,null,"SI237",{"$f":"IF(C75=\"\",\"\",VLOOKUP(C75,[1]Matkul!$A$2:$B$332,2,0))","v":"Pendidikan Anti Korupsi"},{"$f":"IF(C75=\"\",\"\",VLOOKUP(C75,[1]Matkul!$A$2:$C$332,3,0))","v":2},{"$f":"IF(C75=\"\",\"\",VLOOKUP(C75,[1]Matkul!$A$2:$D$332,4,0))","v":7}]
[null,null,"SI148",{"$f":"IF(C76=\"\",\"\",VLOOKUP(C76,[1]Matkul!$A$2:$B$332,2,0))","v":"Pendidikan Anti Korupsi"},{"$f":"IF(C76=\"\",\"\",VLOOKUP(C76,[1]Matkul!$A$2:$C$332,3,0))","v":2},{"$f":"IF(C76=\"\",\"\",VLOOKUP(C76,[1]Matkul!$A$2:$D$332,4,0))","v":7}]
[null,"Taqwa Hari Guna, S.T., M.Kom., Dr.","TI001",{"$f":"IF(C77=\"\",\"\",VLOOKUP(C77,[1]Matkul!$A$2:$B$332,2,0))","v":"Pendidikan Pancasila dan Kewarganegaraan"},{"$f":"IF(C77=\"\",\"\",VLOOKUP(C77,[1]Matkul!$A$2:$C$332,3,0))","v":3},{"$f":"IF(C77=\"\",\"\",VLOOKUP(C77,[1]Matkul!$A$2:$D$332,4,0))","v":1}]
[null,null,"AP202",{"$f":"IF(C78=\"\",\"\",VLOOKUP(C78,[1]Matkul!$A$2:$B$332,2,0))","v":"Pendidikan Pancasila dan Kewarganegaraan"},{"$f":"IF(C78=\"\",\"\",VLOOKUP(C78,[1]Matkul!$A$2:$C$332,3,0))","v":3},{"$f":"IF(C78=\"\",\"\",VLOOKUP(C78,[1]Matkul!$A$2:$D$332,4,0))","v":1}]
[null,null,"SI133",{"$f":"IF(C79=\"\",\"\",VLOOKUP(C79,[1]Matkul!$A$2:$B$332,2,0))","v":"Pendidikan Pancasila dan Kewarganegaraan"},{"$f":"IF(C79=\"\",\"\",VLOOKUP(C79,[1]Matkul!$A$2:$C$332,3,0))","v":3},{"$f":"IF(C79=\"\",\"\",VLOOKUP(C79,[1]Matkul!$A$2:$D$332,4,0))","v":5}]
[]
{"$rows_left_out":179}