{"text_format":"3","workbook":"xlsx","n_sheets":6,"sheets":["24-25","Sheet1","Sheet2","rekap","Sheet4","26-27"],"not_rendered":{"defined_names":5},"read":"whole","date_system":"1900"}

{"sheet":"24-25","index":0,"n_rows":182,"n_cols":10,"rows_kept":182,"merged":[[0,0,0,3],[0,6,0,9],[1,0,1,3],[1,6,1,9],[2,0,2,3],[2,6,2,9],[3,0,3,3],[3,6,3,9],[5,0,6,0],[5,1,6,1],[5,2,6,2],[5,3,6,3],[5,6,6,6],[5,7,6,7],[5,8,6,8],[5,9,6,9],[61,0,61,3],[61,6,61,9],[62,0,62,3],[62,6,62,9],[63,0,63,3],[63,6,63,9],[64,0,64,3],[64,6,64,9],[66,0,67,0],[66,1,67,1],[66,2,67,2],[66,3,67,3],[66,6,67,6],[66,7,67,7],[66,8,67,8],[66,9,67,9],[102,0,102,3],[102,6,102,9],[103,0,103,3],[103,6,103,9],[104,0,104,3],[104,6,104,9],[105,0,105,3],[105,6,105,9],[107,0,108,0],[107,1,108,1],[107,2,108,2],[107,3,108,3],[107,6,108,6],[107,7,108,7],[107,8,108,8],[107,9,108,9],[143,0,143,3],[143,6,143,9],[144,0,144,3],[144,6,144,9],[145,0,145,3],[145,6,145,9],[146,0,146,3],[146,6,146,9],[148,0,149,0],[148,1,149,1],[148,2,149,2],[148,3,149,3],[148,6,149,6],[148,7,149,7],[148,8,149,8],[148,9,149,9]]}
["KELOMPOK PELATIHAN SUPER UNGGUL (PSU)",{"$nulls":5},"KELOMPOK PELATIHAN SUPER UNGGUL (PSU)"]
["KELOMPOK P.1 ( Ruang AULA )",{"$nulls":5},"KELOMPOK S.1 ( Ruang AULA )"]
["SENIN-SELASA, 24-25 JANUARI 2022",{"$nulls":5},"SENIN-SELASA, 24-25 JANUARI 2022"]
["08.30-12.30 WIB",{"$nulls":5},"13.00-17.00 WIB"]
[]
["NO.","NIM","NAMA","PRODI",null,null,"NO.","NO.DAF","NAMA","PRODI"]
[]
[1,"17.11.0321","RACHMADDANI","IF",null,null,1,"21SA1002","HARIS JUNIANTO","IF"]
[2,"21SA1023","AGENG DWI KURNIAWAN","IF",null,null,2,"21SA1032","IZAZ ZEIN WIVA AIMAR","IF"]
[3,"21SA1054","NIZAR MURDIJAT","IF",null,null,3,"21SA1060","DAFFA KURNIA PUTRA","IF"]
[4,"21SA1055","PUTRI FEBI UTAMI","IF",null,null,4,"21SA1069","INTAN SOFIATUN","IF"]
[5,"21SA1057","FAISHAL AZHAR NURRAFI","IF",null,null,5,"21SA1070","DINA NURHASANAH","IF"]
[6,"21SA1061","RIZKI FAJAR SEPTIANA","IF",null,null,6,"21SA1089","SANDHYA NUGRAHA QUSNUR AULIA","IF"]
[7,"21SA1084","ROFIQ 'ABDUL ROZAK","IF",null,null,7,"21SA1090","ROBIT KHOERULLOH ARROHMAN","IF"]
[8,"21SA1085","HAIDAR RO'IF","IF",null,null,8,"21SA1117","SAIFULLAH ABIMANYU","IF"]
[9,"21SA1086","MUHAMMAD THORIQ JAMIL","IF",null,null,9,"21SA1119","IQROM ABADI","IF"]
[10,"21SA1112","RIFQI ARIFIN ILHAM","IF",null,null,10,"21SA1147","BENNY PRAYOGO","IF"]
[11,"21SA1114","MUHAMMAD HABIB AL HUDRY","IF",null,null,11,"21SA1149","PRAS TIO RIFKI WIJAYA","IF"]
[12,"21SA1115","WIDYA TRI PURNOMO","IF",null,null,12,"21SA1154","AMIRA AIDA RASHIFA","IF"]
[13,"21SA1138","TIARA DEWI OKTAVIANI","IF",null,null,13,"21SA1177","ALIF FAJRIANSYAH","IF"]
[14,"21SA1142","CHANDRA WAHYU RAFIALDI","IF",null,null,14,"21SA1200","BINTANG FEBRIAND","IF"]
[15,"21SA1143","TEDY ARGO PRATAMA","IF",null,null,15,"21SA1230","FAQIH SANDI LANGIT","IF"]
[16,"21SA1144","MUHAMMAD RAMADA ADITYA","IF",null,null,16,"21SA1259","FIRMAN FATHONI","IF"]
[17,"21SA1172","DHEVRAN BAITU ABDILLAH SINTUSA","IF",null,null,17,"21SA1262","GALANG ARSANDY NOVERDAN PUTRA","IF"]
[18,"21SA1195","GALIONO FAUZAN ALRASYID","IF",null,null,18,"21SA2003","FAKHRUL AKIF MAULANA PUTRA","SI"]
[19,"21SA1225","OAY HERDIAN JAYA SUBAGJA","IF",null,null,19,"21SA2004","ATIK NURHAENI","SI"]
[20,"21SA1255","AFIF WALIYUDIN","IF",null,null,20,"21SA2010","I PUTU NOVANDA JAYA ASDANU","SI"]
[21,"21SA1266","NAILATUL FAIZAH","IF",null,null,21,"21SA2042","IIS SAHITA","SI"]
[22,"21SA2034","TITIN AMELIA","SI",null,null,22,"21SA2044","ANINDYA FIDELA","SI"]
[23,"21SA2048","DAFA ARTA ANGGARA","SI",null,null,23,"21SA2063","RIFQI MUBAROK","SI"]
[24,"21SA2066","ADE CHINTYA ALFIANA HALALUTU","SI",null,null,24,"21SA2071","AYU LESTARI","SI"]
[25,"21SA2099","EL SYAFANGATUN AULIA DIFA","SI",null,null,25,"21SA2107","ISNAUROKHMAH","SI"]
[26,"21SA2127","FISABILLA TIDAR YOGA PRATAMA","SI",null,null,26,"21SA2132","MUHAMMAD AMRIZAL","SI"]
[27,"21SA2130","AMELIA RAHMADANI","SI",null,null,27,"21SA2147","MUTIARA VEDA YESENIA","SI"]
[28,"21SA2141","SALSA FATHATURRAHMA","SI",null,null,28,"21SA2153","NAURA ARUM KARTIKA","SI"]
[29,"21SA2159","ADITIYA SADANA","SI",null,null,29,"21SA2164","RIZQY RIDWAN HAMID","SI"]
[30,"21SA2162","DIMAS REVINDRA MARAGITA","SI",null,null,30,"21SA3018","ZULFA CHAFIDZ NUR","TI"]
[31,"21SA3014","YUSRON ALIF ADHITYA","TI",null,null,31,"21SA3022","ADE TOTI FEBRIAN","TI"]
[32,"21SA3017","DIMAS TEGAR PRAKOSO","TI",null,null,32,"21SA3040","RESTU HIDAYAT","TI"]
[33,"21SA3036","MUFTI ABDILLAH ALFAN","TI",null,null,33,"21SA3045","MUHAMMAD LUQMANUL HAKIM","TI"]
[34,"21SA3039","WAHYU NUGROHO","TI",null,null,34,"21SA3065","ANGLING PUTRA PRATAMA","TI"]
[35,"21SA3060","IKHSAN FATHONI","TI",null,null,35,"21SA3069","RAFKA ANANTYA HANAFAN","TI"]
[36,"21SA3084","FAUZAN ALIF RAMDANI","TI",null,null,36,"21SA3088","MICHAEL FRANSJAYA","TI"]
[37,"21SA3095","SEPTIA PUTRI HANDAYANI","TI",null,null,37,"21SA3111","MUHAMMAD FADEL ASY SYA' BANY","TI"]
[38,"21SA3107","BUDI HARTONO","TI",null,null,38,"21SB1002","MOHAMMAD ALDHI VERDIANTO","BD"]
[39,"21SB1014","ANISA NUROHMAH","BD",null,null,39,"21SB1023","ADIVA IKA FEBITA SARI","BD"]
[40,"21SB1045","GHAZI FARHANU DISASMORO","BD",null,null,40,"21SB1055","NIDA FATIHATUL ARDHANA","BD"]
[41,"21SB1049","SAMSIAR","BD",null,null,41,"21SB1060","A.ADI SAKHOUL IRTIFA","BD"]
[42,"21SB2004","PUTRI SESILIA FEBRIANDINI","IK",null,null,42,"21SB2002","FITRINA MARDHATILLAH","IK"]
[43,"21SB2006","RAYA ADIL NAWANGSIT","IK",null,null,43,"21SB2014","USWATUN HASANAH","IK"]
[44,"21SB2023","DIDI SETIYADI","IK",null,null,44,"21SB2021","RIZKY DAFFA JULIYANTO","IK"]
[45,"21SB2031","NADYA WAHYU ZAHRA SETYORINI","IK",null,null,45,"21SB2028","M.RAFIUN NASRUL MAJID","IK"]
[46,"21SB2044","AMANDA LUTFI AKHYALITA","IK",null,null,46,"21SB2043","CALLYSTA AMELIA PUTRI","IK"]
[47,"21SB2051","AHMAD BAGUS CAHYO","IK",null,null,47,"21SB2050","DIVA AQILA LUTFIAH","IK"]
[48,"21SB2063","DILA NURMALA SARI","IK",null,null,48,"21SB2069","YORDAN APEPRILIYANTO","IK"]
[49,"21SB2073","ETIKA NURWIJAYANTI","IK",null,null,49,"21SB2081","DIYAS NURSEPTIYANA","IK"]
[50,"21SB2074","DIMAS PRAYOGO","IK",null,null,50,"21SB2082","BOBBY DARMAWAN","IK"]
[51,"21SB2109","RAKA FACHRI ALDHANA","IK",null,null,51,"21SB2118","MAUFI ASKARUDIN HADI","IK"]
[52,"21SB2117","NINDY PUTRI ARDIYATI","IK",null,null,52,"21SB2126","VYTA YUNIAR","IK"]
[]
[]
["KELOMPOK PELATIHAN SUPER UNGGUL (PSU)",{"$nulls":5},"KELOMPOK PELATIHAN SUPER UNGGUL (PSU)"]
["KELOMPOK P.2 ( Ruang 2.1 )",{"$nulls":5},"KELOMPOK S.2 ( Ruang 2.1 )"]
["SENIN-SELASA, 24-25 JANUARI 2022",{"$nulls":5},"SENIN-SELASA, 24-25 JANUARI 2022"]
["08.30-12.30 WIB",{"$nulls":5},"13.00-17.00 WIB"]
[]
["NO.","NIM","NAMA","PRODI",null,null,"NO.","NO.DAF","NAMA","PRODI"]
[]
[1,"18.11.0256","DAFA FAUZAN JUNDULLOH","IF",null,null,1,"21SA1003","IFRANDITYA WISNU PUTRA","IF"]
[2,"21SA1025","RELUNG GASLANDI YONARMEDA","IF",null,null,2,"21SA1033","FARHAN FADILLAH","IF"]
[3,"21SA1056","ANNISA PRATIWI","IF",null,null,3,"21SA1063","NAUFAL NURCAHYO","IF"]
[4,"21SA1145","MERLINA IDAWATI","IF",null,null,4,"21SA1157","LULU YULIASTUTI","IF"]
[5,"21SA1173","FATHULARSY","IF",null,null,5,"21SA1178","ERZA IKHSANI","IF"]
[6,"21SA1197","MUHAMAD AHDI NUR FIKRI","IF",null,null,6,"21SA1201","BARUNA PUTRA WICAKSONO","IF"]
[7,"21SA1226","WISNU MUNANDAR","IF",null,null,7,"21SA1233","EDIS SAPUTRA APRIANSAH","IF"]
[8,"21SA1256","SAMAS SAFI'I","IF",null,null,8,"21SA1261","EVALDO PUTRA ARDIAN SYAH","IF"]
[9,"21SA1267","SEPIA AYU PERMATASARI","IF",null,null,9,"21SA2001","AURORA NUR OKTAVIA","SI"]
[10,"21SA2036","DITA LUKITASARI","SI",null,null,10,"21SA2008","RIZKI MAHENDRA","SI"]
[11,"21SA2052","FAOZAN DWIKI RAMADANA","SI",null,null,11,"21SA2043","AMANDA AYU NOVITASARI","SI"]
[12,"21SA2067","LITA WIDIASTUTI","SI",null,null,12,"21SA2069","FABIANUS KEVIN SENDUK","SI"]
[13,"21SA2103","AZ ZAHRA DWI NUR ADIYA","SI",null,null,13,"21SA2072","FARAH SETYANINGSIH","SI"]
[14,"21SA2128","BANI RIYADI","SI",null,null,14,"21SA2108","ZUHRIYATUL LUBNA","SI"]
[15,"21SA2133","ANIEC ANAFISAH PRATIWI","SI",null,null,15,"21SA2134","DIMAS SIGIT PURNOMO","SI"]
[16,"21SA2160","ALAN JUMAN MASAID","SI",null,null,16,"21SA2148","YULIA ANGGRAINI","SI"]
[17,"21SA3015","FARREL KRISTISA ERLANGGA","TI",null,null,17,"21SA3019","WANDRI MAULID","TI"]
[18,"21SA3037","RAFI YULIS ANDRIYAN","TI",null,null,18,"21SA3041","YOSUA ALDINATA","TI"]
[19,"21SA3061","FASIH BIR AHMAD JAMIL","TI",null,null,19,"21SA3067","SOFYAN HARYONO","TI"]
[20,"21SA3085","HIKMALUL A'LA SYAHRIZALDY","TI",null,null,20,"21SA3089","REZKY ZURKHANI ZULHAN","TI"]
[21,"21SA3106","ANNA NIKMATUR PANGESTI","TI",null,null,21,"21SA3112","PRIMANA AKMAL NURFAOZI","TI"]
[22,"21SA3108","WILDAN IMANIKA SAKTI","TI",null,null,22,"21SB1005","DESTA ARVIANSYAH","BD"]
[23,"21SB1017","SINDHY NUR AZIZAH","BD",null,null,23,"21SB1024","ASRITHOIFAH","BD"]
[24,"21SB1048","MUHAMAD FA'IK FARHANI","BD",null,null,24,"21SB1056","RAKHMAWATI RAMADHANI","BD"]
[25,"21SB1050","JANISAH INDAH WULANDARI","BD",null,null,25,"21SB1061","ERSA YUNI PRANOTO PUTRA","BD"]
[26,"21SB2007","ELLEN DELA SALSABILA","IK",null,null,26,"21SB2015","LUTFIAH NOOR JANNAH","IK"]
[27,"21SB2024","ANANG FIRMANSYAH","IK",null,null,27,"21SB2035","FILDAN ADITYA RAMADHAN","IK"]
[28,"21SB2047","MAILATUL DELLA FADILA","IK",null,null,28,"21SB2052","DILLA AZHAR SEVAPRILIA","IK"]
[29,"21SB2075","SATRIA YUDA NURSETIANTO","IK",null,null,29,"21SB2083","KHOLIS SAMSUDIN","IK"]
[30,"21SB2076","AUDREY RAHMANINGTYAS","IK",null,null,30,"21SB2084","UMI NUR ZAKATIKA","IK"]
[31,"21SB2110","AHMAD RIZKA ANNAFI","IK",null,null,31,"21SB2119","SEPTIYAN TRIWIDODO","IK"]
[32,"21SB2122","MAYLANIY WAKHIDAH","IK",null,null,32,"21SB2127","VIORELLA ZEINA MAHARANI SUNYOTO","IK"]
[]
[]
["KELOMPOK PELATIHAN SUPER UNGGUL (PSU)",{"$nulls":5},"KELOMPOK PELATIHAN SUPER UNGGUL (PSU)"]
["KELOMPOK P.3 ( Ruang 2.2 )",{"$nulls":5},"KELOMPOK S.3 ( Ruang 2.2 )"]
["SENIN-SELASA, 24-25 JANUARI 2022",{"$nulls":5},"SENIN-SELASA, 24-25 JANUARI 2022"]
["08.30-12.30 WIB",{"$nulls":5},"13.00-17.00 WIB"]
[]
["NO.","NIM","NAMA","PRODI",null,null,"NO.","NO.DAF","NAMA","PRODI"]
[]
[1,"18.12.0141","LUTHFI CAHYA ANDHIKA","SI",null,null,1,"21SA1004","CAKRA GANDA","IF"]
[2,"20SA2096","MOHAMAD BAGAS PUTRA","SI",null,null,2,"21SA1034","NANDEZKA RIASA WIDODO","IF"]
[3,"20SB1015","IMAM NUR VAUSI","BD",null,null,3,"21SA1064","DANUAJI NOVAL PRASETYO","IF"]
[4,"21SA1027","MUHAMMAD SEPTHIAN RAFI FALAH","IF",null,null,4,"21SA1071","MEISY NUR LAELY","IF"]
[5,"21SA1058","YUNIAN RAFI HIDAYAT","IF",null,null,5,"21SA1091","REZA PRAYUDA","IF"]
[6,"21SA1148","NADIA NUR ISMALIA","IF",null,null,6,"21SA1121","IKHSAN DWI SETO","IF"]
[7,"21SA1175","YOGA MUSTASFA FADLI","IF",null,null,7,"21SA1150","ROFI AZHAR","IF"]
[8,"21SA1198","BAGAS AJI FEBRYANTO","IF",null,null,8,"21SA1158","VELIZHA SANDY KUSUMA","IF"]
[9,"21SA1228","AGUS ABDUL MANAN HAMAS","IF",null,null,9,"21SA1180","BAYU RUSANTO","IF"]
[10,"21SA1257","ADI KUSUMA","IF",null,null,10,"21SA1202","NAUFAL YOGI APTANA","IF"]
[11,"21SA2037","SERLI","SI",null,null,11,"21SA1235","NICHOLAS OTTO WIJAYA","IF"]
[12,"21SA2059","KODIR","SI",null,null,12,"21SA2073","LIFA SHOLIAH","SI"]
[13,"21SA2068","RIRIT FARIHATUL KAMILAH","SI",null,null,13,"21SA2075","ANUNG SUPRIYADI","SI"]
[14,"21SA2104","DWI AMELIA","SI",null,null,14,"21SA2109","NURUL HANI","SI"]
[15,"21SA2129","AKHMAL ANGGA SYAHPUTRA","SI",null,null,15,"21SA2135","BIBIT WALUYO","SI"]
[16,"21SA2137","ZANELA ANANIA SYAFIKAH","SI",null,null,16,"21SA2150","DIVA RESTI HIDAYAH","SI"]
[17,"21SA2161","ERIK HALMA ROUF","SI",null,null,17,"21SA3021","GEMILANG REYNALDI SURYOADHIVA","TI"]
[18,"21SA3016","RAFLI MA'RUF IRAWAN","TI",null,null,18,"21SA3042","QURUNUL BACHRI RAHMA DIAR SEFF","TI"]
[19,"21SA3038","GHAZY PERDANA PUTRA","TI",null,null,19,"21SA3068","ABROR ROZAQI PUTRA WARANDHIKA","TI"]
[20,"21SA3062","TEGAR UNGGUL PRAMUDYA","TI",null,null,20,"21SA3091","ALAM SAMUDERA","TI"]
[21,"21SA3086","LUKI FIRMANSYAH","TI",null,null,21,"21SA3113","NADIF NASAR GHANIM","TI"]
[22,"21SA3109","IMAMUL IHSAN","TI",null,null,22,"21SB1007","ACHMAD ILHAM NECHRUL ULUM","BD"]
[23,"21SB1020","SEKAR AJENG WIDYOSARI","BD",null,null,23,"21SB1025","NAFISAH HELDA PRATIWI","BD"]
[24,"21SB1051","SAHITYA JATI DWISESA","BD",null,null,24,"21SB1057","PIKKY RINATA AULIA","BD"]
[25,"21SB1052","BAYU RAHADI NATANAEL","BD",null,null,25,"21SB1062","HANGGA CANDRA SAPUTRA","BD"]
[26,"21SB2009","MELINDA AYUNEINGTYA","IK",null,null,26,"21SB2016","SEKAR PRAMUDYA DAMAYANTI","IK"]
[27,"21SB2025","JUSTIN MARCELINO PANDU NAGRI","IK",null,null,27,"21SB2036","DANDI AMRULLAH","IK"]
[28,"21SB2048","ANGGELINA SALMA","IK",null,null,28,"21SB2053","ADELLA DWI ANJANI","IK"]
[29,"21SB2077","RISKA ISNAENI","IK",null,null,29,"21SB2085","MOHAMAD WILDAN BANBELA","IK"]
[30,"21SB2078","FAUZAN GILANG ADIWIBOWO","IK",null,null,30,"21SB2087","NUR AZIZAH SAPUTRI","IK"]
[31,"21SB2111","SAYOGA PRIAMBUDI","IK",null,null,31,"21SB2120","DEDI PRIYANTO","IK"]
[32,"21SB2123","VINA AMANDA","IK",null,null,32,"21SB2128","DESSYANA NURSAFITRI","IK"]
[]
[]
["KELOMPOK PELATIHAN SUPER UNGGUL (PSU)",{"$nulls":5},"KELOMPOK PELATIHAN SUPER UNGGUL (PSU)"]
["KELOMPOK P.4 ( Ruang 2.3 )",{"$nulls":5},"KELOMPOK S.4 ( Ruang 2.3 )"]
["SENIN-SELASA, 24-25 JANUARI 2022",{"$nulls":5},"SENIN-SELASA, 24-25 JANUARI 2022"]
["08.30-12.30 WIB",{"$nulls":5},"13.00-17.00 WIB"]
[]
["NO.","NIM","NAMA","PRODI",null,null,"NO.","NO.DAF","NAMA","PRODI"]
[]
[1,"20SA1166","MUHAMAD NAUFAL BURHANUDDIN BALIT","IF",null,null,1,"21SA1006","BERNARDUS SEPTIAN CAHYA PUTRA","IF"]
[2,"21SA1028","MUHAMMAD ZACKY RAMADHAN","IF",null,null,2,"21SA1035","HANAN ABDUL GHANI","IF"]
[3,"21SA1059","RAFLI NUR ALVIANSYAH","IF",null,null,3,"21SA1066","SAMSUL ARIFIN","IF"]
[4,"21SA1065","ZAKKI KHAERUL UMAM","IF",null,null,4,"21SA1079","FINDI PUTRI AINI","IF"]
[5,"21SA1088","PRADITYA RAFI RISTIAN","IF",null,null,5,"21SA1092","NUR AZIZ SETIAWAN","IF"]
[6,"21SA1116","DEDE NURJAMAN","IF",null,null,6,"21SA1122","RAFI RAHMAT DANI","IF"]
[7,"21SA1146","WASIS RISKIMAN","IF",null,null,7,"21SA1151","YUSUF INDRA RABBANI","IF"]
[8,"21SA1153","JIHAN SALSABILA","IF",null,null,8,"21SA1162","DIAH AYU NABILA","IF"]
[9,"21SA1176","MAGHRISYA GALANG SAMUDERA","IF",null,null,9,"21SA1181","MUHAMMAD HATTA DINATA","IF"]
[10,"21SA1199","DIMAS SHAFA MALIK ISMAIL","IF",null,null,10,"21SA1203","YANUAR RIZKI PRAMONO","IF"]
[11,"21SA1229","ANDI ARISKI","IF",null,null,11,"21SA1237","RAHMAN WAHYU AJI","IF"]
[12,"21SA1258","DONI RAIKHAN","IF",null,null,12,"21SA1263","GINDA DWI PAMUNGKAS","IF"]
[13,"21SA2002","NAJMUL AZKA","SI",null,null,13,"21SA2005","NAURALIA SYIFA AYUNDA","SI"]
[14,"21SA2038","SYAWALIA RAHAYU","SI",null,null,14,"21SA2014","CANNES LINGGA YOGARIO","SI"]
[15,"21SA2061","ARI FATTAH FUADDIN","SI",null,null,15,"21SA2045","ULFA INAYATUN","SI"]
[16,"21SA2070","SETIANA DWI MAGHFIROH","SI",null,null,16,"21SA2074","REMA SEKAR NURIANI","SI"]
[17,"21SA2105","ELSA AYUNDA PRATIWI","SI",null,null,17,"21SA2080","RIZKI NUGROHO","SI"]
[18,"21SA2131","ABDUL KHOHAR","SI",null,null,18,"21SA2110","AUREL ALUNA","SI"]
[19,"21SA3064","FEBRIANTO","TI",null,null,19,"21SA2136","RIZKY FIRMAN ARDIANSYAH","SI"]
[20,"21SA3087","FADLI KHOIRU BAROKAH","TI",null,null,20,"21SA3092","BANGKIT ANOM SEDHAYU","TI"]
[21,"21SA3110","RAIHAN INDRA PRATAMA","TI",null,null,21,"21SA3114","GUNTUR AJI PANGESTU","TI"]
[22,"21SB1001","RAKA ATHALLAH PUTRA","BD",null,null,22,"21SB1012","IQBAL SETYO PRIATMOKO","BD"]
[23,"21SB1022","REFITA DWI NURJANAH","BD",null,null,23,"21SB1027","HASNA AMALIA PUTRI","BD"]
[24,"21SB1053","NEGO BINANDRA FIKAN","BD",null,null,24,"21SB1058","DEASY FITYATUN RUSTIAN","BD"]
[25,"21SB1054","MAULITA NUR SEJATI","BD",null,null,25,"21SB1063","FAIZAL BAIHAQI ARDI THORIQOH","BD"]
[26,"21SB2010","GHEFIRA ERDI RAHMAGITA","IK",null,null,26,"21SB2018","DEWI IKA WIJAYANTI","IK"]
[27,"21SB2027","LISTIAN ABIYYU SUROSO","IK",null,null,27,"21SB2037","ATHA SHALIH","IK"]
[28,"21SB2049","AJI SRI REJEKI","IK",null,null,28,"21SB2055","NOVITA NUR MELIA","IK"]
[29,"21SB2079","AJENG DITA ALFIANI","IK",null,null,29,"21SB2086","MUHAMMAD DAFA FIRMANSYAH","IK"]
[30,"21SB2080","YEHEZKIEL HERNANDA WIDHARTO","IK",null,null,30,"21SB2088","SILVIA PUTRI NUR FADILA HIDAYAT","IK"]
[31,"21SB2113","FARHAN AKBAR FACHREZI","IK",null,null,31,"21SB2121","FAHDI NUNJABA SASHI RAMADHAN","IK"]
[32,"21SB2124","RATIH INDRASWARI MELANI","IK",null,null,32,"21SB2129","FITRI NURAINI","IK"]

{"sheet":"Sheet1","index":1,"n_rows":495,"n_cols":6,"rows_kept":495,"hidden":true}
["nodaf",null,"NPM","NAMA","x","y"]
["170001AO",{"$f":"VALUE(LEFT(A2,6))","v":170001},"17.11.0001","DITA FERDIAN BAYU KUSUMA",{"$f":"C2","v":"17.11.0001"},{"$f":"COUNTIF(#REF!,E2)","v":{"$error":"#REF!"}}]
["170006AO",170006,"17.11.0002","RIZQI MUSTHOFA",{"$f":"C3","v":"17.11.0002"},{"$f":"COUNTIF(#REF!,E3)","v":{"$error":"#REF!"}}]
["170024AO",170024,"17.11.0003","JANUARIO SUBECTI BANO","17.11.0003",{"$f":"COUNTIF(#REF!,E4)","v":{"$error":"#REF!"}}]
["170023AO",170023,"17.11.0004","LABIB FAUZI RAMADAN","17.11.0004",{"$f":"COUNTIF(#REF!,E5)","v":{"$error":"#REF!"}}]
["170026AO",170026,"17.11.0005","NANA SABRINA","17.11.0005",{"$f":"COUNTIF(#REF!,E6)","v":{"$error":"#REF!"}}]
["170008AO",170008,"17.11.0006","BIMA RASENDRIYA INDRASTOTO","17.11.0006",{"$f":"COUNTIF(#REF!,E7)","v":{"$error":"#REF!"}}]
["170016AO",170016,"17.11.0007","RANGGA GUSTI ANANTA","17.11.0007",{"$f":"COUNTIF(#REF!,E8)","v":{"$error":"#REF!"}}]
["170007AO",170007,"17.11.0008","AZIZAN NURHAKIM","17.11.0008",{"$f":"COUNTIF(#REF!,E9)","v":{"$error":"#REF!"}}]
["170022AO",170022,"17.11.0009","SUSANTO","17.11.0009",{"$f":"COUNTIF(#REF!,E10)","v":{"$error":"#REF!"}}]
["170020AO",170020,"17.11.0010","RIYAN EKO SAPUTRA","17.11.0010",{"$f":"COUNTIF(#REF!,E11)","v":{"$error":"#REF!"}}]
["170037AO",170037,"17.11.0011","MOHAMAD BAGUS WIDIYANTO","17.11.0011",{"$f":"COUNTIF(#REF!,E12)","v":{"$error":"#REF!"}}]
["170049AO",170049,"17.11.0012","LAELATUL ROFIDA","17.11.0012",{"$f":"COUNTIF(#REF!,E13)","v":{"$error":"#REF!"}}]
["170066AO",170066,"17.11.0013","RANGGA PRANGWEDANA JANUWARSA","17.11.0013",{"$f":"COUNTIF(#REF!,E14)","v":{"$error":"#REF!"}}]
["170073AO",170073,"17.11.0014","SEPTIAN PRIMANSYAH","17.11.0014",{"$f":"COUNTIF(#REF!,E15)","v":{"$error":"#REF!"}}]
["170040AO",170040,"17.11.0015","DEBI INDARTO","17.11.0015",{"$f":"COUNTIF(#REF!,E16)","v":{"$error":"#REF!"}}]
["170051AO",170051,"17.11.0016","ARIEF KURNIA RAMADHANI","17.11.0016",{"$f":"COUNTIF(#REF!,E17)","v":{"$error":"#REF!"}}]
["170069AO",170069,"17.11.0017","YUSUF SUPRIYATNA","17.11.0017",{"$f":"COUNTIF(#REF!,E18)","v":{"$error":"#REF!"}}]
["170082AO",170082,"17.11.0018","KURNIAWAN SAPUTRA","17.11.0018",{"$f":"COUNTIF(#REF!,E19)","v":{"$error":"#REF!"}}]
["170030AO",170030,"17.11.0019","CANDRA YANUAR DWI  NURCAHYO","17.11.0019",{"$f":"COUNTIF(#REF!,E20)","v":{"$error":"#REF!"}}]
["170092AO",170092,"17.11.0020","AFIF MA'RUF ESKA","17.11.0020",{"$f":"COUNTIF(#REF!,E21)","v":{"$error":"#REF!"}}]
["170095AO",170095,"17.11.0021","SOLEH NUR HAYAT","17.11.0021",{"$f":"COUNTIF(#REF!,E22)","v":{"$error":"#REF!"}}]
["170101AO",170101,"17.11.0022","AURORA DWI KHATULISTIAN","17.11.0022",{"$f":"COUNTIF(#REF!,E23)","v":{"$error":"#REF!"}}]
["170060AO",170060,"17.11.0023","DARMORO WINANJAR SASMIKO","17.11.0023",{"$f":"COUNTIF(#REF!,E24)","v":{"$error":"#REF!"}}]
["170072AO",170072,"17.11.0024","ASEP SETIAJI","17.11.0024",{"$f":"COUNTIF(#REF!,E25)","v":{"$error":"#REF!"}}]
["170115AO",170115,"17.11.0025","RAHILA NUR JANAH","17.11.0025",{"$f":"COUNTIF(#REF!,E26)","v":{"$error":"#REF!"}}]
["170111AO",170111,"17.11.0026","CHRISTIANTO TRI MULYANTO PUTRA","17.11.0026",{"$f":"COUNTIF(#REF!,E27)","v":{"$error":"#REF!"}}]
["170071AO",170071,"17.11.0027","PUTU LEO KHARISMA BANGSA","17.11.0027",{"$f":"COUNTIF(#REF!,E28)","v":{"$error":"#REF!"}}]
["170002AO",170002,"17.11.0028","DAFFA RIZQI ANDRIAN","17.11.0028",{"$f":"COUNTIF(#REF!,E29)","v":{"$error":"#REF!"}}]
["170096AO",170096,"17.11.0029","AHMAD ALWI RAHMAN","17.11.0029",{"$f":"COUNTIF(#REF!,E30)","v":{"$error":"#REF!"}}]
["170035AO",170035,"17.11.0030","ENTUK AJI NUGROHO","17.11.0030",{"$f":"COUNTIF(#REF!,E31)","v":{"$error":"#REF!"}}]
["170070AO",170070,"17.11.0031","WISNU PRASETYA","17.11.0031",{"$f":"COUNTIF(#REF!,E32)","v":{"$error":"#REF!"}}]
["170052AO",170052,"17.11.0032","AFFAN AZ ZARQONI","17.11.0032",{"$f":"COUNTIF(#REF!,E33)","v":{"$error":"#REF!"}}]
["170055AO",{"$f":"VALUE(LEFT(A34,6))","v":170055},"17.11.0033","DEDY ISTIADY PUJIANADA","17.11.0033",{"$f":"COUNTIF(#REF!,E34)","v":{"$error":"#REF!"}}]
["170045AO",170045,"17.11.0034","FAUZAN AJI","17.11.0034",{"$f":"COUNTIF(#REF!,E35)","v":{"$error":"#REF!"}}]
["170160AO",170160,"17.11.0035","FARIS KELVIANTO","17.11.0035",{"$f":"COUNTIF(#REF!,E36)","v":{"$error":"#REF!"}}]
["170116AO",170116,"17.11.0036","KRISNO","17.11.0036",{"$f":"COUNTIF(#REF!,E37)","v":{"$error":"#REF!"}}]
["170034AO",170034,"17.11.0037","JUAN SEBACHTIAN","17.11.0037",{"$f":"COUNTIF(#REF!,E38)","v":{"$error":"#REF!"}}]
["170107AO",170107,"17.11.0038","NURAZIS ADHIRAMA PAMUNGKAS","17.11.0038",{"$f":"COUNTIF(#REF!,E39)","v":{"$error":"#REF!"}}]
["170150AO",170150,"17.11.0039","WAHYU BUDI PRAKOSO","17.11.0039",{"$f":"COUNTIF(#REF!,E40)","v":{"$error":"#REF!"}}]
["170132AO",170132,"17.11.0040","DEFRIA ISKANTO","17.11.0040",{"$f":"COUNTIF(#REF!,E41)","v":{"$error":"#REF!"}}]
["170148AO",170148,"17.11.0041","RIFKI LESTIANTO","17.11.0041",{"$f":"COUNTIF(#REF!,E42)","v":{"$error":"#REF!"}}]
["170050AO",170050,"17.11.0042","AFREL PUTRA MAHENDRA","17.11.0042",{"$f":"COUNTIF(#REF!,E43)","v":{"$error":"#REF!"}}]
["170021AO",170021,"17.11.0043","RIAN PRIADI","17.11.0043",{"$f":"COUNTIF(#REF!,E44)","v":{"$error":"#REF!"}}]
["170053AO",170053,"17.11.0044","ARIF SUPRIYONO","17.11.0044",{"$f":"COUNTIF(#REF!,E45)","v":{"$error":"#REF!"}}]
["170117AO",170117,"17.11.0045","DITA PURNAMASARI","17.11.0045",{"$f":"COUNTIF(#REF!,E46)","v":{"$error":"#REF!"}}]
["170015AO",170015,"17.11.0046","ADAM AMIRUDIN","17.11.0046",{"$f":"COUNTIF(#REF!,E47)","v":{"$error":"#REF!"}}]
["170014AO",170014,"17.11.0047","ABDUL GHOFUR","17.11.0047",{"$f":"COUNTIF(#REF!,E48)","v":{"$error":"#REF!"}}]
["170018AO",170018,"17.11.0048","ARI NUR RIZKI","17.11.0048",{"$f":"COUNTIF(#REF!,E49)","v":{"$error":"#REF!"}}]
["170038AO",170038,"17.11.0049","ACHMAD DIAN RAFI'I","17.11.0049",{"$f":"COUNTIF(#REF!,E50)","v":{"$error":"#REF!"}}]
["170062AO",170062,"17.11.0050","FIQRI OCKAS PERDANA","17.11.0050",{"$f":"COUNTIF(#REF!,E51)","v":{"$error":"#REF!"}}]
["170120AO",170120,"17.11.0051","LUTFI ERIYAN","17.11.0051",{"$f":"COUNTIF(#REF!,E52)","v":{"$error":"#REF!"}}]
["170213AO",170213,"17.11.0052","IHWAN PRASETIO","17.11.0052",{"$f":"COUNTIF(#REF!,E53)","v":{"$error":"#REF!"}}]
["170207AO",170207,"17.11.0053","IMAM SYAFII","17.11.0053",{"$f":"COUNTIF(#REF!,E54)","v":{"$error":"#REF!"}}]
["170231AO",170231,"17.11.0054","REIYVAL WILIM PRATAMA","17.11.0054",{"$f":"COUNTIF(#REF!,E55)","v":{"$error":"#REF!"}}]
["170103AO",170103,"17.11.0055","ZURNAEN EVAN ZIZA RIADHI","17.11.0055",{"$f":"COUNTIF(#REF!,E56)","v":{"$error":"#REF!"}}]
["170104AO",170104,"17.11.0056","FAISAL ISKA UKHRIZA","17.11.0056",{"$f":"COUNTIF(#REF!,E57)","v":{"$error":"#REF!"}}]
["170136AO",170136,"17.11.0057","ALDI SETIA PAMBUDI","17.11.0057",{"$f":"COUNTIF(#REF!,E58)","v":{"$error":"#REF!"}}]
["170246AO",170246,"17.11.0058","TRI HASTOMO","17.11.0058",{"$f":"COUNTIF(#REF!,E59)","v":{"$error":"#REF!"}}]
["170142AO",170142,"17.11.0059","SONY GUNAWAN ZEN","17.11.0059",{"$f":"COUNTIF(#REF!,E60)","v":{"$error":"#REF!"}}]
["170222AO",170222,"17.11.0060","BELLA AGUSTIA","17.11.0060",{"$f":"COUNTIF(#REF!,E61)","v":{"$error":"#REF!"}}]
["170234AO",170234,"17.11.0061","ILHAM ALFAN HIDAYAT","17.11.0061",{"$f":"COUNTIF(#REF!,E62)","v":{"$error":"#REF!"}}]
["170156AO",170156,"17.11.0062","AHMAD HISYAM ADNAN","17.11.0062",{"$f":"COUNTIF(#REF!,E63)","v":{"$error":"#REF!"}}]
["170155AO",170155,"17.11.0063","MOCH ATANAL YAQIN","17.11.0063",{"$f":"COUNTIF(#REF!,E64)","v":{"$error":"#REF!"}}]
["170261AO",170261,"17.11.0064","YOGA AGUNG PRABOWO","17.11.0064",{"$f":"COUNTIF(#REF!,E65)","v":{"$error":"#REF!"}}]
["170252AO",{"$f":"VALUE(LEFT(A66,6))","v":170252},"17.11.0065","NAUFAL GUSNI JANUNG PANGKAR","17.11.0065",{"$f":"COUNTIF(#REF!,E66)","v":{"$error":"#REF!"}}]
["170110AO",{"$f":"VALUE(LEFT(A67,6))","v":170110},"17.11.0066","LISNA YANUAR MUKHLIS",{"$f":"C67","v":"17.11.0066"},{"$f":"COUNTIF(#REF!,E67)","v":{"$error":"#REF!"}}]
["170255AO",170255,"17.11.0067","BRILIAN ALFAIN NUSA BHAKTI","17.11.0067",{"$f":"COUNTIF(#REF!,E68)","v":{"$error":"#REF!"}}]
["170183AO",170183,"17.11.0068","FAISAL RIYADI","17.11.0068",{"$f":"COUNTIF(#REF!,E69)","v":{"$error":"#REF!"}}]
["170282AO",170282,"17.11.0069","ARIF NUGROHO AJI","17.11.0069",{"$f":"COUNTIF(#REF!,E70)","v":{"$error":"#REF!"}}]
["170251AO",170251,"17.11.0070","DARMAWAN KUSUMA","17.11.0070",{"$f":"COUNTIF(#REF!,E71)","v":{"$error":"#REF!"}}]
["170297AO",170297,"17.11.0071","UMAM EGA PRATAMA","17.11.0071",{"$f":"COUNTIF(#REF!,E72)","v":{"$error":"#REF!"}}]
["170200AO",170200,"17.11.0072","BAHARUDDIN AL FADHILAH","17.11.0072",{"$f":"COUNTIF(#REF!,E73)","v":{"$error":"#REF!"}}]
["170004AO",170004,"17.11.0073","GAGAT BASKORO SYAH","17.11.0073",{"$f":"COUNTIF(#REF!,E74)","v":{"$error":"#REF!"}}]
["170349AO",170349,"17.11.0074","CANDRA SANTIKA","17.11.0074",{"$f":"COUNTIF(#REF!,E75)","v":{"$error":"#REF!"}}]
["170324AO",170324,"17.11.0075","DAVA YURISDIKA","17.11.0075",{"$f":"COUNTIF(#REF!,E76)","v":{"$error":"#REF!"}}]
["170179AO",170179,"17.11.0076","JALUMIYOS RAMADHIANSYAH","17.11.0076",{"$f":"COUNTIF(#REF!,E77)","v":{"$error":"#REF!"}}]
["170224AO",170224,"17.11.0078","TRI MUJI RAHAYU","17.11.0078",{"$f":"COUNTIF(#REF!,E78)","v":{"$error":"#REF!"}}]
["170127AO",170127,"17.11.0079","SIMON SOFIAN IWAN WIBOWO","17.11.0079",{"$f":"COUNTIF(#REF!,E79)","v":{"$error":"#REF!"}}]
["170269AO",170269,"17.11.0080","KEVIN ZEFANYA TIRTA IRAWAN","17.11.0080",{"$f":"COUNTIF(#REF!,E80)","v":{"$error":"#REF!"}}]
["170336AO",170336,"17.11.0081","MAMAT SUPRIYANTO","17.11.0081",{"$f":"COUNTIF(#REF!,E81)","v":{"$error":"#REF!"}}]
["170348AO",170348,"17.11.0082","IMUNG DWI UPAYA","17.11.0082",{"$f":"COUNTIF(#REF!,E82)","v":{"$error":"#REF!"}}]
["170279AO",170279,"17.11.0083","ABIDIN HIDAYANTO","17.11.0083",{"$f":"COUNTIF(#REF!,E83)","v":{"$error":"#REF!"}}]
["170193AO",170193,"17.11.0084","IRVAN EKA ZAENALDI","17.11.0084",{"$f":"COUNTIF(#REF!,E84)","v":{"$error":"#REF!"}}]
["170385AO",170385,"17.11.0085","IRFAN RIFAI AZIZ","17.11.0085",{"$f":"COUNTIF(#REF!,E85)","v":{"$error":"#REF!"}}]
["170271AO",170271,"17.11.0086","LUTFI NUR DIANTO","17.11.0086",{"$f":"COUNTIF(#REF!,E86)","v":{"$error":"#REF!"}}]
["170239AO",170239,"17.11.0087","HERMAWAN DWI PRAYITNO","17.11.0087",{"$f":"COUNTIF(#REF!,E87)","v":{"$error":"#REF!"}}]
["170265AO",170265,"17.11.0088","DINO PURNAMA AJI","17.11.0088",{"$f":"COUNTIF(#REF!,E88)","v":{"$error":"#REF!"}}]
["170370AO",170370,"17.11.0089","DONI HIDAYAT","17.11.0089",{"$f":"COUNTIF(#REF!,E89)","v":{"$error":"#REF!"}}]
["170302AO",170302,"17.11.0090","EDI IMAM MUTAQIN","17.11.0090",{"$f":"COUNTIF(#REF!,E90)","v":{"$error":"#REF!"}}]
["170274AO",170274,"17.11.0091","GHAUSHIL BADRI AMIN","17.11.0091",{"$f":"COUNTIF(#REF!,E91)","v":{"$error":"#REF!"}}]
["170331AO",170331,"17.11.0092","ACHMAD RUSLIYANSYAH SAFRONI","17.11.0092",{"$f":"COUNTIF(#REF!,E92)","v":{"$error":"#REF!"}}]
["170303AO",170303,"17.11.0093","ZIDA KUMALA SA'ADAH","17.11.0093",{"$f":"COUNTIF(#REF!,E93)","v":{"$error":"#REF!"}}]
["170291AO",170291,"17.11.0094","MU'AZIZ FAJARUDIN","17.11.0094",{"$f":"COUNTIF(#REF!,E94)","v":{"$error":"#REF!"}}]
["170333AO",170333,"17.11.0095","FADILLAH ANSORI","17.11.0095",{"$f":"COUNTIF(#REF!,E95)","v":{"$error":"#REF!"}}]
["170313AO",170313,"17.11.0096","SHAFIRA RIZKY","17.11.0096",{"$f":"COUNTIF(#REF!,E96)","v":{"$error":"#REF!"}}]
["170257AO",170257,"17.11.0097","RIZQI GILANG RAMADHAN","17.11.0097",{"$f":"COUNTIF(#REF!,E97)","v":{"$error":"#REF!"}}]
["170233AO",170233,"17.11.0098","JULI MAULANA","17.11.0098",{"$f":"COUNTIF(#REF!,E98)","v":{"$error":"#REF!"}}]
["170238AO",170238,"17.11.0099","ALFANDI RIFQI WIDYADANA","17.11.0099",{"$f":"COUNTIF(#REF!,E99)","v":{"$error":"#REF!"}}]
["170237AO",170237,"17.11.0100","RIZKY BAKHTIAR","17.11.0100",{"$f":"COUNTIF(#REF!,E100)","v":{"$error":"#REF!"}}]
["170425AO",170425,"17.11.0101","RAFI RAMADHAN","17.11.0101",{"$f":"COUNTIF(#REF!,E101)","v":{"$error":"#REF!"}}]
["170417AO",170417,"17.11.0102","ABDUL AZIZ","17.11.0102",{"$f":"COUNTIF(#REF!,E102)","v":{"$error":"#REF!"}}]
["170432AO",170432,"17.11.0103","BAYU SETIAJI","17.11.0103",{"$f":"COUNTIF(#REF!,E103)","v":{"$error":"#REF!"}}]
["170029AO",170029,"17.11.0104","CAROKO WASESO YEKTI","17.11.0104",{"$f":"COUNTIF(#REF!,E104)","v":{"$error":"#REF!"}}]
["170444AO",170444,"17.11.0105","JIMMY HANDRIANSYAH","17.11.0105",{"$f":"COUNTIF(#REF!,E105)","v":{"$error":"#REF!"}}]
["170433AO",170433,"17.11.0106","MUHAMAD ABDUL MUFIDZ","17.11.0106",{"$f":"COUNTIF(#REF!,E106)","v":{"$error":"#REF!"}}]
["170345AO",170345,"17.11.0107","JEFFRI IRAWAN","17.11.0107",{"$f":"COUNTIF(#REF!,E107)","v":{"$error":"#REF!"}}]
["170435AO",170435,"17.11.0108","FARHAN BANI RIZKI","17.11.0108",{"$f":"COUNTIF(#REF!,E108)","v":{"$error":"#REF!"}}]
["170434AO",170434,"17.11.0109","LU'AI NUR FIRDAUS","17.11.0109",{"$f":"COUNTIF(#REF!,E109)","v":{"$error":"#REF!"}}]
["170298AO",170298,"17.11.0110","INSAN IKHLASUL AMAL","17.11.0110",{"$f":"COUNTIF(#REF!,E110)","v":{"$error":"#REF!"}}]
["170299AO",170299,"17.11.0111","RENO DERMAWAN MUTIARA PUTRA","17.11.0111",{"$f":"COUNTIF(#REF!,E111)","v":{"$error":"#REF!"}}]
["170484AO",170484,"17.11.0112","ABI DWI RAFDI","17.11.0112",{"$f":"COUNTIF(#REF!,E112)","v":{"$error":"#REF!"}}]
["170153AO",170153,"17.11.0113","FARA NOVI ANA","17.11.0113",{"$f":"COUNTIF(#REF!,E113)","v":{"$error":"#REF!"}}]
["170235AO",170235,"17.11.0114","ILHAM AKBAR HABIBIE","17.11.0114",{"$f":"COUNTIF(#REF!,E114)","v":{"$error":"#REF!"}}]
["170463AO",170463,"17.11.0115","FAHMI SAPTIAN LUBIS","17.11.0115",{"$f":"COUNTIF(#REF!,E115)","v":{"$error":"#REF!"}}]
["170301AO",170301,"17.11.0116","AMMAR SHOLEH ARYANTO","17.11.0116",{"$f":"COUNTIF(#REF!,E116)","v":{"$error":"#REF!"}}]
["170266AO",170266,"17.11.0117","GAGAH WINASIS","17.11.0117",{"$f":"COUNTIF(#REF!,E117)","v":{"$error":"#REF!"}}]
["170403AO",170403,"17.11.0118","NOVIANTO SIDIK PRADANA","17.11.0118",{"$f":"COUNTIF(#REF!,E118)","v":{"$error":"#REF!"}}]
["170236AO",170236,"17.11.0119","HUSNI HAMZAH","17.11.0119",{"$f":"COUNTIF(#REF!,E119)","v":{"$error":"#REF!"}}]
["170530AO",170530,"17.11.0120","ISMU IRAWAN","17.11.0120",{"$f":"COUNTIF(#REF!,E120)","v":{"$error":"#REF!"}}]
["170468AO",170468,"17.11.0121","ENGGAR PRI PAMBUDI","17.11.0121",{"$f":"COUNTIF(#REF!,E121)","v":{"$error":"#REF!"}}]
["170262AO",170262,"17.11.0122","SETIANINGSIH","17.11.0122",{"$f":"COUNTIF(#REF!,E122)","v":{"$error":"#REF!"}}]
["170487AO",170487,"17.11.0124","FAIZAL RAMADHAN SUYITNO PUTRA","17.11.0124",{"$f":"COUNTIF(#REF!,E123)","v":{"$error":"#REF!"}}]
["170506AO",170506,"17.11.0125","BAGAS SURYATAMA","17.11.0125",{"$f":"COUNTIF(#REF!,E124)","v":{"$error":"#REF!"}}]
["170033AO",170033,"17.11.0126","MUHAMMAD RIZA FAUZILLAH","17.11.0126",{"$f":"COUNTIF(#REF!,E125)","v":{"$error":"#REF!"}}]
["170391AO",170391,"17.11.0127","ANGGA FERDIYANTO","17.11.0127",{"$f":"COUNTIF(#REF!,E126)","v":{"$error":"#REF!"}}]
["170512AO",170512,"17.11.0128","ADIL AMRULLAH","17.11.0128",{"$f":"COUNTIF(#REF!,E127)","v":{"$error":"#REF!"}}]
["170539AO",170539,"17.11.0129","RESTU LALIN PUTRA SATRIA","17.11.0129",{"$f":"COUNTIF(#REF!,E128)","v":{"$error":"#REF!"}}]
["170126AO",170126,"17.11.0130","ALDILIYA AINUN MADJID","17.11.0130",{"$f":"COUNTIF(#REF!,E129)","v":{"$error":"#REF!"}}]
["170166AO",170166,"17.11.0131","FIQRI ADRIANSYAH","17.11.0131",{"$f":"COUNTIF(#REF!,E130)","v":{"$error":"#REF!"}}]
["170558AO",{"$f":"VALUE(LEFT(A131,6))","v":170558},"17.11.0132","NUR ACHMAD MUKTI AZIZ",{"$f":"C131","v":"17.11.0132"},{"$f":"COUNTIF(#REF!,E131)","v":{"$error":"#REF!"}}]
["170483AO",170483,"17.11.0133","FAHMI REZA SAHPUTRA","17.11.0133",{"$f":"COUNTIF(#REF!,E132)","v":{"$error":"#REF!"}}]
["170579AO",170579,"17.11.0134","AFIF ANDI NUR AGAZI","17.11.0134",{"$f":"COUNTIF(#REF!,E133)","v":{"$error":"#REF!"}}]
["170397AO",170397,"17.11.0135","NUR AZIZ PRAMUDYA","17.11.0135",{"$f":"COUNTIF(#REF!,E134)","v":{"$error":"#REF!"}}]
["170182AO",170182,"17.11.0136","DIDIK WICAKSONO","17.11.0136",{"$f":"COUNTIF(#REF!,E135)","v":{"$error":"#REF!"}}]
["170416AO",170416,"17.11.0137","MULKI ALI MUBAROK","17.11.0137",{"$f":"COUNTIF(#REF!,E136)","v":{"$error":"#REF!"}}]
["170364AO",170364,"17.11.0138","MUHAMMAD RIFQI ARIYADI","17.11.0138",{"$f":"COUNTIF(#REF!,E137)","v":{"$error":"#REF!"}}]
["170458AO",170458,"17.11.0139","NUR HANIFAH","17.11.0139",{"$f":"COUNTIF(#REF!,E138)","v":{"$error":"#REF!"}}]
["170524AO",170524,"17.11.0140","ADIMAS SYAFI'I","17.11.0140",{"$f":"COUNTIF(#REF!,E139)","v":{"$error":"#REF!"}}]
["170482AO",170482,"17.11.0141","CHANIF FAUZI","17.11.0141",{"$f":"COUNTIF(#REF!,E140)","v":{"$error":"#REF!"}}]
["170332AO",170332,"17.11.0142","PUTRI DWI ERFIYANTI","17.11.0142",{"$f":"COUNTIF(#REF!,E141)","v":{"$error":"#REF!"}}]
["170531AO",170531,"17.11.0143","YULIAN AJRI ARDIANSYAH","17.11.0143",{"$f":"COUNTIF(#REF!,E142)","v":{"$error":"#REF!"}}]
["170578AO",170578,"17.11.0144","HENDRI KUAT FEBRIANSYAH","17.11.0144",{"$f":"COUNTIF(#REF!,E143)","v":{"$error":"#REF!"}}]
["170386AO",170386,"17.11.0145","EKA SUCI NOPIE HANTARI","17.11.0145",{"$f":"COUNTIF(#REF!,E144)","v":{"$error":"#REF!"}}]
["170436AO",170436,"17.11.0146","NUHGROHO BAHARUDIN PUTRA","17.11.0146",{"$f":"COUNTIF(#REF!,E145)","v":{"$error":"#REF!"}}]
["170346AO",170346,"17.11.0147","MUHAMMAD RAHMAT HADIYAMIN","17.11.0147",{"$f":"COUNTIF(#REF!,E146)","v":{"$error":"#REF!"}}]
["170275AO",170275,"17.11.0148","RISKI RAHMATULOH","17.11.0148",{"$f":"COUNTIF(#REF!,E147)","v":{"$error":"#REF!"}}]
["170584AO",170584,"17.11.0149","DINA FAJAR SULISTIYANI","17.11.0149",{"$f":"COUNTIF(#REF!,E148)","v":{"$error":"#REF!"}}]
["170456AO",170456,"17.11.0150","HANIN SEDI SEPTIAN","17.11.0150",{"$f":"COUNTIF(#REF!,E149)","v":{"$error":"#REF!"}}]
["170191AO",170191,"17.11.0151","RINA ELMI SOFIANA","17.11.0151",{"$f":"COUNTIF(#REF!,E150)","v":{"$error":"#REF!"}}]
["170481AO",170481,"17.11.0152","IRHAM MOHAMAD FADLI","17.11.0152",{"$f":"COUNTIF(#REF!,E151)","v":{"$error":"#REF!"}}]
["170511AO",170511,"17.11.0153","FERDYNAN ARI RAHMADAN","17.11.0153",{"$f":"COUNTIF(#REF!,E152)","v":{"$error":"#REF!"}}]
["170270AO",170270,"17.11.0154","KURNIA HANDARA","17.11.0154",{"$f":"COUNTIF(#REF!,E153)","v":{"$error":"#REF!"}}]
["170479AO",170479,"17.11.0155","YOGA DWI PRASETYO","17.11.0155",{"$f":"COUNTIF(#REF!,E154)","v":{"$error":"#REF!"}}]
["170449AO",170449,"17.11.0156","KENDY KUKILA","17.11.0156",{"$f":"COUNTIF(#REF!,E155)","v":{"$error":"#REF!"}}]
["170401AO",170401,"17.11.0157","RISQI BAYU PRATAMA","17.11.0157",{"$f":"COUNTIF(#REF!,E156)","v":{"$error":"#REF!"}}]
["170258AO",170258,"17.11.0158","YUDHISTIRA JANICE AL SAVA","17.11.0158",{"$f":"COUNTIF(#REF!,E157)","v":{"$error":"#REF!"}}]
["170189AO",170189,"17.11.0159","YOGA MAULANA","17.11.0159",{"$f":"COUNTIF(#REF!,E158)","v":{"$error":"#REF!"}}]
["170589AO",170589,"17.11.0160","RIZQI AGUNG SETIA WIBOWO","17.11.0160",{"$f":"COUNTIF(#REF!,E159)","v":{"$error":"#REF!"}}]
["170502AO",170502,"17.11.0161","TEGUH BUDI SANTOSO","17.11.0161",{"$f":"COUNTIF(#REF!,E160)","v":{"$error":"#REF!"}}]
["170068AO",170068,"17.11.0162","MOHAMMAD RIZALDI PRADANA","17.11.0162",{"$f":"COUNTIF(#REF!,E161)","v":{"$error":"#REF!"}}]
["170460AO",170460,"17.11.0163","GUNTUR EKA PRASETYO","17.11.0163",{"$f":"COUNTIF(#REF!,E162)","v":{"$error":"#REF!"}}]
["170169AO",170169,"17.11.0164","MUKJIZAT SETIO NUGROHO","17.11.0164",{"$f":"COUNTIF(#REF!,E163)","v":{"$error":"#REF!"}}]
["170467AO",170467,"17.11.0166","FERDINAND NYOMAN DHANDI SETYAWAN","17.11.0166",{"$f":"COUNTIF(#REF!,E164)","v":{"$error":"#REF!"}}]
["170128AO",170128,"17.11.0167","ADI BUDI PRASETYO","17.11.0167",{"$f":"COUNTIF(#REF!,E165)","v":{"$error":"#REF!"}}]
["170173AO",170173,"17.11.0168","AI FADJAR ALDIADI","17.11.0168",{"$f":"COUNTIF(#REF!,E166)","v":{"$error":"#REF!"}}]
["170431AO",170431,"17.11.0169","RAHMAT HIDAYAT FITRIANTO","17.11.0169",{"$f":"COUNTIF(#REF!,E167)","v":{"$error":"#REF!"}}]
["170634AO",170634,"17.11.0170","RAHARDIAN ARIF PRATAMA","17.11.0170",{"$f":"COUNTIF(#REF!,E168)","v":{"$error":"#REF!"}}]
["170513AO",170513,"17.11.0171","DANANG RIKIYANTO","17.11.0171",{"$f":"COUNTIF(#REF!,E169)","v":{"$error":"#REF!"}}]
["170618AO",170618,"17.11.0172","SENDI SETIAWAN","17.11.0172",{"$f":"COUNTIF(#REF!,E170)","v":{"$error":"#REF!"}}]
["170469AO",170469,"17.11.0173","DITA AYUNINGTIAS","17.11.0173",{"$f":"COUNTIF(#REF!,E171)","v":{"$error":"#REF!"}}]
["170471AO",170471,"17.11.0174","CYNTHIA SILVIANA WIJAYANTI","17.11.0174",{"$f":"COUNTIF(#REF!,E172)","v":{"$error":"#REF!"}}]
["170492AO",170492,"17.11.0175","AL HAFIDZ HANIFAN ISLAHI","17.11.0175",{"$f":"COUNTIF(#REF!,E173)","v":{"$error":"#REF!"}}]
["170418AO",170418,"17.11.0176","TRIONO ANGGI NUGROHO","17.11.0176",{"$f":"COUNTIF(#REF!,E174)","v":{"$error":"#REF!"}}]
["170320AO",170320,"17.11.0177","ALFA RIZKI","17.11.0177",{"$f":"COUNTIF(#REF!,E175)","v":{"$error":"#REF!"}}]
["170409AO",170409,"17.11.0178","ABI YOGA TAMPOMO","17.11.0178",{"$f":"COUNTIF(#REF!,E176)","v":{"$error":"#REF!"}}]
["170529AO",170529,"17.11.0179","GILANG NUR ALFIAN","17.11.0179",{"$f":"COUNTIF(#REF!,E177)","v":{"$error":"#REF!"}}]
["170065AO",170065,"17.11.0180","UTAMI DINI PUSPITA","17.11.0180",{"$f":"COUNTIF(#REF!,E178)","v":{"$error":"#REF!"}}]
["170375AO",170375,"17.11.0181","INDRA ALAN NUGROHO","17.11.0181",{"$f":"COUNTIF(#REF!,E179)","v":{"$error":"#REF!"}}]
["170514AO",170514,"17.11.0182","ERICK SETIO PAMUJI","17.11.0182",{"$f":"COUNTIF(#REF!,E180)","v":{"$error":"#REF!"}}]
["170247AO",170247,"17.11.0183","ZSA ZSA GRACIA SUPRIANTO","17.11.0183",{"$f":"COUNTIF(#REF!,E181)","v":{"$error":"#REF!"}}]
["170538AO",170538,"17.11.0184","PANJI IRAWAN","17.11.0184",{"$f":"COUNTIF(#REF!,E182)","v":{"$error":"#REF!"}}]
["170547AO",170547,"17.11.0185","WAHYU PRASETYO","17.11.0185",{"$f":"COUNTIF(#REF!,E183)","v":{"$error":"#REF!"}}]
["170089AO",170089,"17.11.0186","MUHAMAD MACHFUDZ ALDIANSYAH","17.11.0186",{"$f":"COUNTIF(#REF!,E184)","v":{"$error":"#REF!"}}]
["170306AO",170306,"17.11.0187","ANANG SUDARMAYA","17.11.0187",{"$f":"COUNTIF(#REF!,E185)","v":{"$error":"#REF!"}}]
["170225AO",170225,"17.11.0188","DWI JOKO PURNOMO","17.11.0188",{"$f":"COUNTIF(#REF!,E186)","v":{"$error":"#REF!"}}]
["170537AO",170537,"17.11.0189","MOH FADLIL FAQIH","17.11.0189",{"$f":"COUNTIF(#REF!,E187)","v":{"$error":"#REF!"}}]
["170454AO",170454,"17.11.0190","JERI IHSAN HIDAYATULLOH","17.11.0190",{"$f":"COUNTIF(#REF!,E188)","v":{"$error":"#REF!"}}]
["170019AO",170019,"17.11.0191","GILANG RIZKY MUSTOFA","17.11.0191",{"$f":"COUNTIF(#REF!,E189)","v":{"$error":"#REF!"}}]
["170557AO",170557,"17.11.0192","FAISAL LUTFI HAKIM","17.11.0192",{"$f":"COUNTIF(#REF!,E190)","v":{"$error":"#REF!"}}]
["170185AO",170185,"17.11.0193","ANDRIANUS AGUNG NUGROHO","17.11.0193",{"$f":"COUNTIF(#REF!,E191)","v":{"$error":"#REF!"}}]
["170205AO",170205,"17.11.0194","ADITYA DAMARJATI","17.11.0194",{"$f":"COUNTIF(#REF!,E192)","v":{"$error":"#REF!"}}]
["170497AO",170497,"17.11.0195","HELMI FAKHRUDDIN","17.11.0195",{"$f":"COUNTIF(#REF!,E193)","v":{"$error":"#REF!"}}]
["170164AO",170164,"17.11.0196","WILDAN MUBAROK AZZAKKI","17.11.0196",{"$f":"COUNTIF(#REF!,E194)","v":{"$error":"#REF!"}}]
["170204AO",{"$f":"VALUE(LEFT(A195,6))","v":170204},"17.11.0197","MOHAMMAD SHOFYAN FAURI",{"$f":"C195","v":"17.11.0197"},{"$f":"COUNTIF(#REF!,E195)","v":{"$error":"#REF!"}}]
["170517AO",170517,"17.11.0198","IRAWAN BAROKAH","17.11.0198",{"$f":"COUNTIF(#REF!,E196)","v":{"$error":"#REF!"}}]
["170493AO",170493,"17.11.0199","MUHAMMAD ILHAM HANAFI","17.11.0199",{"$f":"COUNTIF(#REF!,E197)","v":{"$error":"#REF!"}}]
["170146AO",170146,"17.11.0200","MUHAMMAD ANDY HIDAYAT","17.11.0200",{"$f":"COUNTIF(#REF!,E198)","v":{"$error":"#REF!"}}]
["170437AO",170437,"17.11.0201","IVAN SETYA AZMI","17.11.0201",{"$f":"COUNTIF(#REF!,E199)","v":{"$error":"#REF!"}}]
["170170AO",170170,"17.11.0202","DEDE IRAWAN","17.11.0202",{"$f":"COUNTIF(#REF!,E200)","v":{"$error":"#REF!"}}]
["170544AO",170544,"17.11.0203","GALIH AHMAD ZAKIA RAMADHAN","17.11.0203",{"$f":"COUNTIF(#REF!,E201)","v":{"$error":"#REF!"}}]
["170604AO",170604,"17.11.0204","RIZKY YOGA PANGESTU","17.11.0204",{"$f":"COUNTIF(#REF!,E202)","v":{"$error":"#REF!"}}]
["170408AO",170408,"17.11.0205","INDO CRIS MAXI DEMORE YAN RAMADHANI","17.11.0205",{"$f":"COUNTIF(#REF!,E203)","v":{"$error":"#REF!"}}]
["170388AO",170388,"17.11.0206","M SULKHAN TAMA RAMDHANI","17.11.0206",{"$f":"COUNTIF(#REF!,E204)","v":{"$error":"#REF!"}}]
["170568AO",170568,"17.11.0207","HANENDYO ANDHI GURITA","17.11.0207",{"$f":"COUNTIF(#REF!,E205)","v":{"$error":"#REF!"}}]
["170625AO",170625,"17.11.0208","HASANANTO ZAKARIA","17.11.0208",{"$f":"COUNTIF(#REF!,E206)","v":{"$error":"#REF!"}}]
["170503AO",170503,"17.11.0209","MUFLIH DZULFIAN","17.11.0209",{"$f":"COUNTIF(#REF!,E207)","v":{"$error":"#REF!"}}]
["170612AO",170612,"17.11.0210","RAMADHAN ARIF NURBASKORO","17.11.0210",{"$f":"COUNTIF(#REF!,E208)","v":{"$error":"#REF!"}}]
["170639AO",170639,"17.11.0211","MUHAMMAD MARSHAL ABDALLAH","17.11.0211",{"$f":"COUNTIF(#REF!,E209)","v":{"$error":"#REF!"}}]
["170601AO",170601,"17.11.0212","AZIZ REZA DWITAMA","17.11.0212",{"$f":"COUNTIF(#REF!,E210)","v":{"$error":"#REF!"}}]
["170551AO",170551,"17.11.0213","ABU RIZAL RAFSANJANI","17.11.0213",{"$f":"COUNTIF(#REF!,E211)","v":{"$error":"#REF!"}}]
["170485AO",170485,"17.11.0214","EGI CAHYA GUSTI YANA","17.11.0214",{"$f":"COUNTIF(#REF!,E212)","v":{"$error":"#REF!"}}]
["170369AO",170369,"17.11.0215","RICKY SUDIYANTO","17.11.0215",{"$f":"COUNTIF(#REF!,E213)","v":{"$error":"#REF!"}}]
["170393AO",170393,"17.11.0216","DANI FAISAL","17.11.0216",{"$f":"COUNTIF(#REF!,E214)","v":{"$error":"#REF!"}}]
["170477AO",170477,"17.11.0217","NABILA AYUNING SAFIRA","17.11.0217",{"$f":"COUNTIF(#REF!,E215)","v":{"$error":"#REF!"}}]
["170528AO",{"$f":"VALUE(LEFT(A216,6))","v":170528},"17.11.0218","GALIH BAGASKORO","17.11.0218",{"$f":"COUNTIF(#REF!,E216)","v":{"$error":"#REF!"}}]
["170491AO",170491,"17.11.0219","WAHYU WIDIANTO","17.11.0219",{"$f":"COUNTIF(#REF!,E217)","v":{"$error":"#REF!"}}]
["170567AO",170567,"17.11.0220","RIZAL SYUKRON NUGROHO","17.11.0220",{"$f":"COUNTIF(#REF!,E218)","v":{"$error":"#REF!"}}]
["170229AO",170229,"17.11.0221","AKHDAN RAHMI HANIF","17.11.0221",{"$f":"COUNTIF(#REF!,E219)","v":{"$error":"#REF!"}}]
["170446AO",170446,"17.11.0222","LINTANG AYU LAILATUL JANNAH","17.11.0222",{"$f":"COUNTIF(#REF!,E220)","v":{"$error":"#REF!"}}]
["170490AO",170490,"17.11.0223","DEMA ABUBAKAR","17.11.0223",{"$f":"COUNTIF(#REF!,E221)","v":{"$error":"#REF!"}}]
["170424AO",170424,"17.11.0224","AGUNG SAPUTRA","17.11.0224",{"$f":"COUNTIF(#REF!,E222)","v":{"$error":"#REF!"}}]
["170163AO",170163,"17.11.0225","ADE PRASTYO","17.11.0225",{"$f":"COUNTIF(#REF!,E223)","v":{"$error":"#REF!"}}]
["170326AO",170326,"17.11.0226","FANDI YULIANTO","17.11.0226",{"$f":"COUNTIF(#REF!,E224)","v":{"$error":"#REF!"}}]
["170123AO",170123,"17.11.0227","AGUNG BUDI PRASETYO","17.11.0227",{"$f":"COUNTIF(#REF!,E225)","v":{"$error":"#REF!"}}]
["170654AO",170654,"17.11.0228","MUH. DANI MUNIF FARIN","17.11.0228",{"$f":"COUNTIF(#REF!,E226)","v":{"$error":"#REF!"}}]
["170064AO",170064,"17.11.0229","ALFIAN KUKUH ADITAMA","17.11.0229",{"$f":"COUNTIF(#REF!,E227)","v":{"$error":"#REF!"}}]
["170655AO",170655,"17.11.0230","HERI RAMADHAN","17.11.0230",{"$f":"COUNTIF(#REF!,E228)","v":{"$error":"#REF!"}}]
["170623AO",170623,"17.11.0231","ABDURRAHMAN AL GHOFIQI","17.11.0231",{"$f":"COUNTIF(#REF!,E229)","v":{"$error":"#REF!"}}]
["170440AO",170440,"17.11.0232","WINDIANINGSIH","17.11.0232",{"$f":"COUNTIF(#REF!,E230)","v":{"$error":"#REF!"}}]
["170276AO",170276,"17.11.0233","ELIAS NABIL","17.11.0233",{"$f":"COUNTIF(#REF!,E231)","v":{"$error":"#REF!"}}]
["170652AO",170652,"17.11.0234","WIRA SAKTI AKBAR RIYADI","17.11.0234",{"$f":"COUNTIF(#REF!,E232)","v":{"$error":"#REF!"}}]
["170592AO",170592,"17.11.0235","KHAUTAL ADANI","17.11.0235",{"$f":"COUNTIF(#REF!,E233)","v":{"$error":"#REF!"}}]
["170390AO",170390,"17.11.0236","ALFIAN WIDY REKSA","17.11.0236",{"$f":"COUNTIF(#REF!,E234)","v":{"$error":"#REF!"}}]
["170186AO",170186,"17.11.0237","ADHI LATIEF MUKTIANA","17.11.0237",{"$f":"COUNTIF(#REF!,E235)","v":{"$error":"#REF!"}}]
["170157AO",170157,"17.11.0238","KARTIKO HAYAT NUGROHO","17.11.0238",{"$f":"COUNTIF(#REF!,E236)","v":{"$error":"#REF!"}}]
["170649AO",170649,"17.11.0239","BAYU SETIA AJI","17.11.0239",{"$f":"COUNTIF(#REF!,E237)","v":{"$error":"#REF!"}}]
["170094AO",170094,"17.11.0240","MUHAMMAD GHOZY LATHIF","17.11.0240",{"$f":"COUNTIF(#REF!,E238)","v":{"$error":"#REF!"}}]
["170546AO",170546,"17.11.0241","TEGAR PAMBUDI","17.11.0241",{"$f":"COUNTIF(#REF!,E239)","v":{"$error":"#REF!"}}]
["170025AO",170025,"17.11.0242","DIMAS AJI PRASETYO","17.11.0242",{"$f":"COUNTIF(#REF!,E240)","v":{"$error":"#REF!"}}]
["170003AO",170003,"17.11.0243","ADIT TRI SEPTIAWAN","17.11.0243",{"$f":"COUNTIF(#REF!,E241)","v":{"$error":"#REF!"}}]
["170059AO",170059,"17.11.0244","WAHYU SURYO NUROHMAN","17.11.0244",{"$f":"COUNTIF(#REF!,E242)","v":{"$error":"#REF!"}}]
["170061AO",170061,"17.11.0245","PURBO DWI ANGGORO","17.11.0245",{"$f":"COUNTIF(#REF!,E243)","v":{"$error":"#REF!"}}]
["170084AO",170084,"17.11.0247","WHISNU ADAM FATHURROKHMAN","17.11.0247",{"$f":"COUNTIF(#REF!,E244)","v":{"$error":"#REF!"}}]
["170077AO",170077,"17.11.0248","RIJAL AMRI MAJID","17.11.0248",{"$f":"COUNTIF(#REF!,E245)","v":{"$error":"#REF!"}}]
["170119AO",170119,"17.11.0250","YULIANDRI SETIADI","17.11.0250",{"$f":"COUNTIF(#REF!,E246)","v":{"$error":"#REF!"}}]
["170139AO",170139,"17.11.0252","LAELI NUR HIDAYATI","17.11.0252",{"$f":"COUNTIF(#REF!,E247)","v":{"$error":"#REF!"}}]
["170174AO",170174,"17.11.0253","MUHAMAD IRFANY MUSA","17.11.0253",{"$f":"COUNTIF(#REF!,E248)","v":{"$error":"#REF!"}}]
["170202AO",170202,"17.11.0254","FAZRI JATI HUMANIKA","17.11.0254",{"$f":"COUNTIF(#REF!,E249)","v":{"$error":"#REF!"}}]
["170256AO",170256,"17.11.0255","HASNA ENDAH SAPTAWATI","17.11.0255",{"$f":"COUNTIF(#REF!,E250)","v":{"$error":"#REF!"}}]
["170253AO",170253,"17.11.0256","ARRYAN SETIAWAN","17.11.0256",{"$f":"COUNTIF(#REF!,E251)","v":{"$error":"#REF!"}}]
["170217AO",170217,"17.11.0257","ANWAR BUDHI DHARMAWAN","17.11.0257",{"$f":"COUNTIF(#REF!,E252)","v":{"$error":"#REF!"}}]
["170321AO",170321,"17.11.0258","AGUNG PUTRA PRATAMA","17.11.0258",{"$f":"COUNTIF(#REF!,E253)","v":{"$error":"#REF!"}}]
["170380AO",170380,"17.11.0259","GHIFARI IDHAM SATRIA NASUTION","17.11.0259",{"$f":"COUNTIF(#REF!,E254)","v":{"$error":"#REF!"}}]
["170447AO",170447,"17.11.0260","M ZIDAN NAJMUL FATAH","17.11.0260",{"$f":"COUNTIF(#REF!,E255)","v":{"$error":"#REF!"}}]
["170426AO",170426,"17.11.0261","RAKHMAT AGENG YUDHANTO","17.11.0261",{"$f":"COUNTIF(#REF!,E256)","v":{"$error":"#REF!"}}]
["170465AO",170465,"17.11.0262","SYAFAAT","17.11.0262",{"$f":"COUNTIF(#REF!,E257)","v":{"$error":"#REF!"}}]
["170085AO",170085,"17.11.0263","FIKRI RAMADHAN","17.11.0263",{"$f":"COUNTIF(#REF!,E258)","v":{"$error":"#REF!"}}]
["170430AO",{"$f":"VALUE(LEFT(A259,6))","v":170430},"17.11.0264","MANUT SUTRISNO",{"$f":"C259","v":"17.11.0264"},{"$f":"COUNTIF(#REF!,E259)","v":{"$error":"#REF!"}}]
["170617AO",170617,"17.11.0265","NUR AULIA RAHMAWATI","17.11.0265",{"$f":"COUNTIF(#REF!,E260)","v":{"$error":"#REF!"}}]
["170582AO",170582,"17.11.0266","DEWI PUPUT SAPUTRI","17.11.0266",{"$f":"COUNTIF(#REF!,E261)","v":{"$error":"#REF!"}}]
["170374AO",170374,"17.11.0267","WAHYU NUGROHO","17.11.0267",{"$f":"COUNTIF(#REF!,E262)","v":{"$error":"#REF!"}}]
["170628AO",170628,"17.11.0268","ABI NANDITA  ARGA  APRIA KUSUMA","17.11.0268",{"$f":"COUNTIF(#REF!,E263)","v":{"$error":"#REF!"}}]
["170561AO",170561,"17.11.0269","BINTARI HIDAYANTI","17.11.0269",{"$f":"COUNTIF(#REF!,E264)","v":{"$error":"#REF!"}}]
["170230AO",170230,"17.11.0270","UBAIDILLAH AHMAD","17.11.0270",{"$f":"COUNTIF(#REF!,E265)","v":{"$error":"#REF!"}}]
["170351AO",170351,"17.11.0271","MUHAMAD HISYAM ZUHDI","17.11.0271",{"$f":"COUNTIF(#REF!,E266)","v":{"$error":"#REF!"}}]
["170196AO",170196,"17.11.0273","WAWA MAISA FINANTO","17.11.0273",{"$f":"COUNTIF(#REF!,E267)","v":{"$error":"#REF!"}}]
["170383AO",170383,"17.11.0275","LUTFI YUDA RAMADHAN","17.11.0275",{"$f":"COUNTIF(#REF!,E268)","v":{"$error":"#REF!"}}]
["170402AO",170402,"17.11.0276","DIYAN WASONO ADHI","17.11.0276",{"$f":"COUNTIF(#REF!,E269)","v":{"$error":"#REF!"}}]
["170421AO",170421,"17.11.0277","MAULUDIA PANJI YULIANSAH","17.11.0277",{"$f":"COUNTIF(#REF!,E270)","v":{"$error":"#REF!"}}]
["170556AO",170556,"17.11.0278","RAHMAWAN AFIANTO SAPUTRO","17.11.0278",{"$f":"COUNTIF(#REF!,E271)","v":{"$error":"#REF!"}}]
["170158AO",170158,"17.11.0279","MUHAMMAD RIFAI","17.11.0279",{"$f":"COUNTIF(#REF!,E272)","v":{"$error":"#REF!"}}]
["170498AO",170498,"17.11.0280","MOCHAMAD RIZAL ASSIDIQ","17.11.0280",{"$f":"COUNTIF(#REF!,E273)","v":{"$error":"#REF!"}}]
["170489AO",170489,"17.11.0281","MUHAMMAD RIFKI UBAEDILLAH","17.11.0281",{"$f":"COUNTIF(#REF!,E274)","v":{"$error":"#REF!"}}]
["170501AO",170501,"17.11.0282","JULIO BHAGASKARA ADIPRADANA","17.11.0282",{"$f":"COUNTIF(#REF!,E275)","v":{"$error":"#REF!"}}]
["170478AO",170478,"17.11.0283","SUSI SULISTYANINGSIH","17.11.0283",{"$f":"COUNTIF(#REF!,E276)","v":{"$error":"#REF!"}}]
["170486AO",170486,"17.11.0284","RULI ANDRESTA","17.11.0284",{"$f":"COUNTIF(#REF!,E277)","v":{"$error":"#REF!"}}]
["170462AO",170462,"17.11.0285","FAUZI TRI HIDAYAT","17.11.0285",{"$f":"COUNTIF(#REF!,E278)","v":{"$error":"#REF!"}}]
["170133AO",170133,"17.11.0286","ACHMAD FERDIYANSYAH","17.11.0286",{"$f":"COUNTIF(#REF!,E279)","v":{"$error":"#REF!"}}]
["170184AO",170184,"17.11.0287","NUR ROCHMAN ALFATONI","17.11.0287",{"$f":"COUNTIF(#REF!,E280)","v":{"$error":"#REF!"}}]
["170344AO",170344,"17.11.0288","KANASTA FIRDAUS","17.11.0288",{"$f":"COUNTIF(#REF!,E281)","v":{"$error":"#REF!"}}]
["170505AO",170505,"17.11.0289","REFIS AULAWY NOOR","17.11.0289",{"$f":"COUNTIF(#REF!,E282)","v":{"$error":"#REF!"}}]
["170152AO",170152,"17.11.0290","SHAFRIAL AZHAR","17.11.0290",{"$f":"COUNTIF(#REF!,E283)","v":{"$error":"#REF!"}}]
["170398AO",170398,"17.11.0291","SHANDI DESTIAWAN","17.11.0291",{"$f":"COUNTIF(#REF!,E284)","v":{"$error":"#REF!"}}]
["170636AO",170636,"17.11.0292","AFIFAH ANANDA PUTRI","17.11.0292",{"$f":"COUNTIF(#REF!,E285)","v":{"$error":"#REF!"}}]
["170381AO",170381,"17.11.0293","FAISHAL ANWAR FADHILLAH","17.11.0293",{"$f":"COUNTIF(#REF!,E286)","v":{"$error":"#REF!"}}]
["170550AO",170550,"17.11.0294","BRAM PRADANA MARDA","17.11.0294",{"$f":"COUNTIF(#REF!,E287)","v":{"$error":"#REF!"}}]
["170595AO",170595,"17.11.0295","WILLY RUBY OKTAVIANUS","17.11.0295",{"$f":"COUNTIF(#REF!,E288)","v":{"$error":"#REF!"}}]
["170645AO",170645,"17.11.0296","MOHAMMAD SYIFA RAMADHAN","17.11.0296",{"$f":"COUNTIF(#REF!,E289)","v":{"$error":"#REF!"}}]
["170057AO",170057,"17.11.0297","SETYO PRIMA AJI","17.11.0297",{"$f":"COUNTIF(#REF!,E290)","v":{"$error":"#REF!"}}]
["170058AO",170058,"17.11.0298","KHAIDIR NALAKHUDIN","17.11.0298",{"$f":"COUNTIF(#REF!,E291)","v":{"$error":"#REF!"}}]
["170287AO",170287,"17.11.0299","MIQDAR ALFI SYAHRIN","17.11.0299",{"$f":"COUNTIF(#REF!,E292)","v":{"$error":"#REF!"}}]
["170292AO",170292,"17.11.0300","MUFID ARZUDA","17.11.0300",{"$f":"COUNTIF(#REF!,E293)","v":{"$error":"#REF!"}}]
["170555AO",170555,"17.11.0301","WAHYU RAMDANI","17.11.0301",{"$f":"COUNTIF(#REF!,E294)","v":{"$error":"#REF!"}}]
["170573AO",170573,"17.11.0302","TIKA SOFIANA","17.11.0302",{"$f":"COUNTIF(#REF!,E295)","v":{"$error":"#REF!"}}]
["170602AO",170602,"17.11.0303","FIKRI ADI SUSENO","17.11.0303",{"$f":"COUNTIF(#REF!,E296)","v":{"$error":"#REF!"}}]
["170367AO",170367,"17.11.0304","SINGGIH SYAFRIZAL","17.11.0304",{"$f":"COUNTIF(#REF!,E297)","v":{"$error":"#REF!"}}]
["170165AO",170165,"17.11.0305","WISNU PAMUNGKAS","17.11.0305",{"$f":"COUNTIF(#REF!,E298)","v":{"$error":"#REF!"}}]
["170599AO",170599,"17.11.0306","SATYA FARIZ NUR ANANTO","17.11.0306",{"$f":"COUNTIF(#REF!,E299)","v":{"$error":"#REF!"}}]
["170642AO",170642,"17.11.0307","ABI FIRMANSYAH","17.11.0307",{"$f":"COUNTIF(#REF!,E300)","v":{"$error":"#REF!"}}]
["170161AO",170161,"17.11.0308","ADE TRIO PAMUNGKAS","17.11.0308",{"$f":"COUNTIF(#REF!,E301)","v":{"$error":"#REF!"}}]
["170285AO",170285,"17.11.0309","RIZKIYANA CATUR PRADANA","17.11.0309",{"$f":"COUNTIF(#REF!,E302)","v":{"$error":"#REF!"}}]
["170569AO",170569,"17.11.0310","JUNIAR IMANDANNI WIDODO","17.11.0310",{"$f":"COUNTIF(#REF!,E303)","v":{"$error":"#REF!"}}]
["170005AO",170005,"17.11.0311","REVAN PUTRA MEIDIO","17.11.0311",{"$f":"COUNTIF(#REF!,E304)","v":{"$error":"#REF!"}}]
["170651AO",170651,"17.11.0312","AHMAD ANDRIAN SYAH","17.11.0312",{"$f":"COUNTIF(#REF!,E305)","v":{"$error":"#REF!"}}]
["170114AO",170114,"17.11.0314","MASADI DWI KURNIAWAN","17.11.0314",{"$f":"COUNTIF(#REF!,E306)","v":{"$error":"#REF!"}}]
["170658AO",170658,"17.11.0315","MOHAMMAD KHAERUL RIZAL","17.11.0315",{"$f":"COUNTIF(#REF!,E307)","v":{"$error":"#REF!"}}]
["170399AO",170399,"17.11.0317","ALFAN RIZKY LUTFIANTO","17.11.0317",{"$f":"COUNTIF(#REF!,E308)","v":{"$error":"#REF!"}}]
["170048AO",170048,"17.11.0318","TUTI SUPRIATININGSIH","17.11.0318",{"$f":"COUNTIF(#REF!,E309)","v":{"$error":"#REF!"}}]
["170663AO",170663,"17.11.0319","FERA EBRI PRIMADANI","17.11.0319",{"$f":"COUNTIF(#REF!,E310)","v":{"$error":"#REF!"}}]
["170648AO",170648,"17.11.0320","AULIA ULINNUHA AL FACHORY","17.11.0320",{"$f":"COUNTIF(#REF!,E311)","v":{"$error":"#REF!"}}]
["170379AO",170379,"17.11.0321","RACHMADDANI","17.11.0321",{"$f":"COUNTIF(#REF!,E312)","v":{"$error":"#REF!"}}]
["170429AO",170429,"17.11.0322","GALIH ALAN MADHANI","17.11.0322",{"$f":"COUNTIF(#REF!,E313)","v":{"$error":"#REF!"}}]
["170121AO",170121,"17.11.0323","ANGGRI PANJI ERMAYA","17.11.0323",{"$f":"COUNTIF(#REF!,E314)","v":{"$error":"#REF!"}}]
["170209AO",170209,"17.11.0324","TEGAR AFIF ASHARI","17.11.0324",{"$f":"COUNTIF(#REF!,E315)","v":{"$error":"#REF!"}}]
["170659AO",170659,"17.11.0326","ALDIKA MULIYANSYAH","17.11.0326",{"$f":"COUNTIF(#REF!,E316)","v":{"$error":"#REF!"}}]
["170626AO",170626,"17.11.0327","PAMUNGKAS CATUR NUGROHO","17.11.0327",{"$f":"COUNTIF(#REF!,E317)","v":{"$error":"#REF!"}}]
["170151AO",170151,"17.11.0328","TRIYONO","17.11.0328",{"$f":"COUNTIF(#REF!,E318)","v":{"$error":"#REF!"}}]
["170232AO",170232,"17.11.0329","RAEZA YUTHA TRIYUNDI","17.11.0329",{"$f":"COUNTIF(#REF!,E319)","v":{"$error":"#REF!"}}]
["170540AO",170540,"17.11.0330","NELLY REGINA SUSANTI","17.11.0330",{"$f":"COUNTIF(#REF!,E320)","v":{"$error":"#REF!"}}]
["170363AO",170363,"17.11.0331","ZIAD MIQDAD HAQQONI","17.11.0331",{"$f":"COUNTIF(#REF!,E321)","v":{"$error":"#REF!"}}]
["170356AO",170356,"17.11.0332","ARI KURNIAWAN PURWANTO","17.11.0332",{"$f":"COUNTIF(#REF!,E322)","v":{"$error":"#REF!"}}]
["170365AO",{"$f":"VALUE(LEFT(A323,6))","v":170365},"17.11.0333","EDI SUPRIYANTO",{"$f":"C323","v":"17.11.0333"},{"$f":"COUNTIF(#REF!,E323)","v":{"$error":"#REF!"}}]
["170656AO",170656,"17.11.0334","ARIS BUDIARTO","17.11.0334",{"$f":"COUNTIF(#REF!,E324)","v":{"$error":"#REF!"}}]
["170653AO",170653,"17.11.0335","KRISWAHYONO","17.11.0335",{"$f":"COUNTIF(#REF!,E325)","v":{"$error":"#REF!"}}]
["170208AO",170208,"17.11.0336","SLAMET KRISNA WIDJAJA","17.11.0336",{"$f":"COUNTIF(#REF!,E326)","v":{"$error":"#REF!"}}]
["170032AO",170032,"17.11.0337","IVAN SURYA WITANTO","17.11.0337",{"$f":"COUNTIF(#REF!,E327)","v":{"$error":"#REF!"}}]
["170177AO",170177,"17.11.0338","IKHFANDA DWI PURNOMO","17.11.0338",{"$f":"COUNTIF(#REF!,E328)","v":{"$error":"#REF!"}}]
["170554AO",170554,"17.11.0339","ANIQ VAUQON NAJAH","17.11.0339",{"$f":"COUNTIF(#REF!,E329)","v":{"$error":"#REF!"}}]
["170353AO",170353,"17.11.0340","RIYANA INDAH CAHYANI","17.11.0340",{"$f":"COUNTIF(#REF!,E330)","v":{"$error":"#REF!"}}]
["170664AO",170664,"17.11.0341","TITIN MARTANTI","17.11.0341",{"$f":"COUNTIF(#REF!,E331)","v":{"$error":"#REF!"}}]
["170534AO",170534,"17.11.0342","KHODIRUN","17.11.0342",{"$f":"COUNTIF(#REF!,E332)","v":{"$error":"#REF!"}}]
["170327AO",170327,"17.11.0343","ARIEF MIFTAH NUR FAIZI","17.11.0343",{"$f":"COUNTIF(#REF!,E333)","v":{"$error":"#REF!"}}]
["170667AO",170667,"17.11.0344","HEFFIANA","17.11.0344",{"$f":"COUNTIF(#REF!,E334)","v":{"$error":"#REF!"}}]
["170668AO",170668,"17.11.0345","GENTUR PRIHATNO","17.11.0345",{"$f":"COUNTIF(#REF!,E335)","v":{"$error":"#REF!"}}]
["170017AO",170017,"17.12.0001","NUR LAELI RACHMAWATI","17.12.0001",{"$f":"COUNTIF(#REF!,E336)","v":{"$error":"#REF!"}}]
["170047AO",170047,"17.12.0002","BAGAS WARDANA","17.12.0002",{"$f":"COUNTIF(#REF!,E337)","v":{"$error":"#REF!"}}]
["170041AO",170041,"17.12.0003","EKY SETIAWAN","17.12.0003",{"$f":"COUNTIF(#REF!,E338)","v":{"$error":"#REF!"}}]
["170009AO",170009,"17.12.0005","CANDRA NOVIAN","17.12.0005",{"$f":"COUNTIF(#REF!,E339)","v":{"$error":"#REF!"}}]
["170108AO",170108,"17.12.0006","ZULFA AULIA","17.12.0006",{"$f":"COUNTIF(#REF!,E340)","v":{"$error":"#REF!"}}]
["170105AO",170105,"17.12.0007","SITI KHUMAEROH","17.12.0007",{"$f":"COUNTIF(#REF!,E341)","v":{"$error":"#REF!"}}]
["170112AO",170112,"17.12.0008","SIDIK BAHTIAR","17.12.0008",{"$f":"COUNTIF(#REF!,E342)","v":{"$error":"#REF!"}}]
["170067AO",170067,"17.12.0009","ROFI SUSI NUR FATIMAH","17.12.0009",{"$f":"COUNTIF(#REF!,E343)","v":{"$error":"#REF!"}}]
["170125AO",170125,"17.12.0010","IFHAM MAFTUKHIN","17.12.0010",{"$f":"COUNTIF(#REF!,E344)","v":{"$error":"#REF!"}}]
["170012AO",170012,"17.12.0011","IFANIA OKTAVIANI PUTRI","17.12.0011",{"$f":"COUNTIF(#REF!,E345)","v":{"$error":"#REF!"}}]
["170031AO",170031,"17.12.0012","ANINDYA ANGGELINA","17.12.0012",{"$f":"COUNTIF(#REF!,E346)","v":{"$error":"#REF!"}}]
["170113AO",170113,"17.12.0014","FADHLAN NUR KHAALISH","17.12.0014",{"$f":"COUNTIF(#REF!,E347)","v":{"$error":"#REF!"}}]
["170197AO",170197,"17.12.0015","YASMIN BUDIWATI","17.12.0015",{"$f":"COUNTIF(#REF!,E348)","v":{"$error":"#REF!"}}]
["170109AO",170109,"17.12.0016","ADE IVAN VANANI","17.12.0016",{"$f":"COUNTIF(#REF!,E349)","v":{"$error":"#REF!"}}]
["170122AO",170122,"17.12.0017","AFIFUR ROHMAN ZAIN","17.12.0017",{"$f":"COUNTIF(#REF!,E350)","v":{"$error":"#REF!"}}]
["170192AO",170192,"17.12.0018","AZHARI RAKHMAT BAKHTIAR","17.12.0018",{"$f":"COUNTIF(#REF!,E351)","v":{"$error":"#REF!"}}]
["170176AO",170176,"17.12.0020","ILHAM HAQQI WIJAYA","17.12.0020",{"$f":"COUNTIF(#REF!,E352)","v":{"$error":"#REF!"}}]
["170212AO",170212,"17.12.0021","MOCHAMMAD OBBY SYECH FRUDDIN","17.12.0021",{"$f":"COUNTIF(#REF!,E353)","v":{"$error":"#REF!"}}]
["170216AO",170216,"17.12.0023","ASIF BAHRIA","17.12.0023",{"$f":"COUNTIF(#REF!,E354)","v":{"$error":"#REF!"}}]
["170315AO",170315,"17.12.0024","ALDISTYA RIESTA SEKARINI","17.12.0024",{"$f":"COUNTIF(#REF!,E355)","v":{"$error":"#REF!"}}]
["170342AO",170342,"17.12.0025","ARIF SUGIARTO","17.12.0025",{"$f":"COUNTIF(#REF!,E356)","v":{"$error":"#REF!"}}]
["170322AO",170322,"17.12.0026","BAHAR NURRUS CHANDRA ALAMSYAH","17.12.0026",{"$f":"COUNTIF(#REF!,E357)","v":{"$error":"#REF!"}}]
["170240AO",170240,"17.12.0027","DESTY SANDRA UTAMI","17.12.0027",{"$f":"COUNTIF(#REF!,E358)","v":{"$error":"#REF!"}}]
["170339AO",170339,"17.12.0028","DEVANDA RIZKI RAMADHAN","17.12.0028",{"$f":"COUNTIF(#REF!,E359)","v":{"$error":"#REF!"}}]
["170254AO",170254,"17.12.0029","SUCI AMALIA","17.12.0029",{"$f":"COUNTIF(#REF!,E360)","v":{"$error":"#REF!"}}]
["170211AO",170211,"17.12.0030","CICI WULAN SARI","17.12.0030",{"$f":"COUNTIF(#REF!,E361)","v":{"$error":"#REF!"}}]
["170260AO",170260,"17.12.0031","RETNO DWI GUSTI HENDARWESTI","17.12.0031",{"$f":"COUNTIF(#REF!,E362)","v":{"$error":"#REF!"}}]
["170242AO",170242,"17.12.0032","HENDI PRADANA","17.12.0032",{"$f":"COUNTIF(#REF!,E363)","v":{"$error":"#REF!"}}]
["170290AO",170290,"17.12.0033","WIDYA HANA SAFITRI","17.12.0033",{"$f":"COUNTIF(#REF!,E364)","v":{"$error":"#REF!"}}]
["170241AO",170241,"17.12.0034","DEVI NURAENI","17.12.0034",{"$f":"COUNTIF(#REF!,E365)","v":{"$error":"#REF!"}}]
["170300AO",170300,"17.12.0035","AMALIA WAHYU UTAMI","17.12.0035",{"$f":"COUNTIF(#REF!,E366)","v":{"$error":"#REF!"}}]
["170172AO",170172,"17.12.0037","MUHAMMAD SAFRIJAL ZULMI","17.12.0037",{"$f":"COUNTIF(#REF!,E367)","v":{"$error":"#REF!"}}]
["170221AO",170221,"17.12.0038","TITIN MEISAROH","17.12.0038",{"$f":"COUNTIF(#REF!,E368)","v":{"$error":"#REF!"}}]
["170181AO",170181,"17.12.0039","ARJUNTORO ARDHY FERDIAN","17.12.0039",{"$f":"COUNTIF(#REF!,E369)","v":{"$error":"#REF!"}}]
["170441AO",170441,"17.12.0040","REYHAN YUDHISTIRA JUNIAN","17.12.0040",{"$f":"COUNTIF(#REF!,E370)","v":{"$error":"#REF!"}}]
["170428AO",170428,"17.12.0041","THESSA AYU PARTOYO","17.12.0041",{"$f":"COUNTIF(#REF!,E371)","v":{"$error":"#REF!"}}]
["170412AO",170412,"17.12.0042","SEKAR ANDINI","17.12.0042",{"$f":"COUNTIF(#REF!,E372)","v":{"$error":"#REF!"}}]
["170413AO",170413,"17.12.0043","RUDI ADITYA","17.12.0043",{"$f":"COUNTIF(#REF!,E373)","v":{"$error":"#REF!"}}]
["170411AO",170411,"17.12.0044","KETY NOVIANTI","17.12.0044",{"$f":"COUNTIF(#REF!,E374)","v":{"$error":"#REF!"}}]
["170450AO",170450,"17.12.0045","HARUN SUFAHMI","17.12.0045",{"$f":"COUNTIF(#REF!,E375)","v":{"$error":"#REF!"}}]
["170499AO",170499,"17.12.0046","NUGROHO CHANDRA BUWONO","17.12.0046",{"$f":"COUNTIF(#REF!,E376)","v":{"$error":"#REF!"}}]
["170259AO",170259,"17.12.0047","MUHAMMAD IKHSAN NURDIN","17.12.0047",{"$f":"COUNTIF(#REF!,E377)","v":{"$error":"#REF!"}}]
["170198AO",170198,"17.12.0048","M.FIQIH FADLI ILMAWAN","17.12.0048",{"$f":"COUNTIF(#REF!,E378)","v":{"$error":"#REF!"}}]
["170371AO",170371,"17.12.0049","ULUNG BUDI HARTONO","17.12.0049",{"$f":"COUNTIF(#REF!,E379)","v":{"$error":"#REF!"}}]
["170560AO",170560,"17.12.0051","FARIZ KHABIB IBROHIM","17.12.0051",{"$f":"COUNTIF(#REF!,E380)","v":{"$error":"#REF!"}}]
["170583AO",170583,"17.12.0052","ZEZYA RAMADHANY KHARISMA MURTI","17.12.0052",{"$f":"COUNTIF(#REF!,E381)","v":{"$error":"#REF!"}}]
["170457AO",170457,"17.12.0053","FAISAL FAUZI","17.12.0053",{"$f":"COUNTIF(#REF!,E382)","v":{"$error":"#REF!"}}]
["170329AO",170329,"17.12.0054","LUSY RAHMAWAN PANGESTU","17.12.0054",{"$f":"COUNTIF(#REF!,E383)","v":{"$error":"#REF!"}}]
["170451AO",170451,"17.12.0055","IRFAN FATKHURROHMAN","17.12.0055",{"$f":"COUNTIF(#REF!,E384)","v":{"$error":"#REF!"}}]
["170522AO",170522,"17.12.0056","LENI SETIANI","17.12.0056",{"$f":"COUNTIF(#REF!,E385)","v":{"$error":"#REF!"}}]
["170472AO",170472,"17.12.0057","ADAM AGENG WIJAYA","17.12.0057",{"$f":"COUNTIF(#REF!,E386)","v":{"$error":"#REF!"}}]
["170305AO",{"$f":"VALUE(LEFT(A387,6))","v":170305},"17.12.0058","MAGHFIRA NURUL ISNAINI",{"$f":"C387","v":"17.12.0058"},{"$f":"COUNTIF(#REF!,E387)","v":{"$error":"#REF!"}}]
["170587AO",170587,"17.12.0059","NADILLA PUTRI UTAMI","17.12.0059",{"$f":"COUNTIF(#REF!,E388)","v":{"$error":"#REF!"}}]
["170553AO",170553,"17.12.0060","MENIK PURWATI","17.12.0060",{"$f":"COUNTIF(#REF!,E389)","v":{"$error":"#REF!"}}]
["170452AO",170452,"17.12.0061","TEGAR DWI RAMADHAN","17.12.0061",{"$f":"COUNTIF(#REF!,E390)","v":{"$error":"#REF!"}}]
["170549AO",170549,"17.12.0062","LISMA NUR SEPTIANA","17.12.0062",{"$f":"COUNTIF(#REF!,E391)","v":{"$error":"#REF!"}}]
["170307AO",170307,"17.12.0063","CHOLIVIA INTAN NUR SAFITRI","17.12.0063",{"$f":"COUNTIF(#REF!,E392)","v":{"$error":"#REF!"}}]
["170594AO",170594,"17.12.0064","VERA CINDI MONARIKE","17.12.0064",{"$f":"COUNTIF(#REF!,E393)","v":{"$error":"#REF!"}}]
["170178AO",170178,"17.12.0065","AULIA PUSPITA ANTARUSMARA","17.12.0065",{"$f":"COUNTIF(#REF!,E394)","v":{"$error":"#REF!"}}]
["170545AO",170545,"17.12.0066","FAIZAL AMIN","17.12.0066",{"$f":"COUNTIF(#REF!,E395)","v":{"$error":"#REF!"}}]
["170063AO",170063,"17.12.0067","APRILIA MELI KRISTINA","17.12.0067",{"$f":"COUNTIF(#REF!,E396)","v":{"$error":"#REF!"}}]
["170086AO",170086,"17.12.0068","NABILA APRILIANTI","17.12.0068",{"$f":"COUNTIF(#REF!,E397)","v":{"$error":"#REF!"}}]
["170600AO",170600,"17.12.0069","CARELL YUDHI HERNANI","17.12.0069",{"$f":"COUNTIF(#REF!,E398)","v":{"$error":"#REF!"}}]
["170621AO",170621,"17.12.0070","SYAFIQ FEBRI PANGESTUNING TYAS","17.12.0070",{"$f":"COUNTIF(#REF!,E399)","v":{"$error":"#REF!"}}]
["170384AO",170384,"17.12.0071","ISTI ROHAYATUN","17.12.0071",{"$f":"COUNTIF(#REF!,E400)","v":{"$error":"#REF!"}}]
["170280AO",170280,"17.12.0072","RAFFI ANDIKA PRADANA","17.12.0072",{"$f":"COUNTIF(#REF!,E401)","v":{"$error":"#REF!"}}]
["170281AO",170281,"17.12.0073","MA'RUF MAFTUKHIN","17.12.0073",{"$f":"COUNTIF(#REF!,E402)","v":{"$error":"#REF!"}}]
["170438AO",170438,"17.12.0074","ROY KRISNA PRATAMA","17.12.0074",{"$f":"COUNTIF(#REF!,E403)","v":{"$error":"#REF!"}}]
["170605AO",170605,"17.12.0075","NICO CESAR ARYANTO PRIMADANA","17.12.0075",{"$f":"COUNTIF(#REF!,E404)","v":{"$error":"#REF!"}}]
["170283AO",170283,"17.12.0076","AYU DISTARIYANI SAPUTRI","17.12.0076",{"$f":"COUNTIF(#REF!,E405)","v":{"$error":"#REF!"}}]
["170046AO",170046,"17.12.0077","HANA AMBAR FATIK WIBAWA","17.12.0077",{"$f":"COUNTIF(#REF!,E406)","v":{"$error":"#REF!"}}]
["170518AO",170518,"17.12.0078","HASTIWI AMELIA NURAWALIAH","17.12.0078",{"$f":"COUNTIF(#REF!,E407)","v":{"$error":"#REF!"}}]
["170535AO",170535,"17.12.0079","REGGY BOWO LEKSANA","17.12.0079",{"$f":"COUNTIF(#REF!,E408)","v":{"$error":"#REF!"}}]
["170519AO",170519,"17.12.0080","NAILIS SYAFI'AH","17.12.0080",{"$f":"COUNTIF(#REF!,E409)","v":{"$error":"#REF!"}}]
["170419AO",170419,"17.12.0081","RISKA INDAH NURANI","17.12.0081",{"$f":"COUNTIF(#REF!,E410)","v":{"$error":"#REF!"}}]
["170461AO",170461,"17.12.0082","ANISA NUR FAIZAH","17.12.0082",{"$f":"COUNTIF(#REF!,E411)","v":{"$error":"#REF!"}}]
["170526AO",170526,"17.12.0083","MOHAMAD AIFAN DWI WIYATAMA ANDRIAN","17.12.0083",{"$f":"COUNTIF(#REF!,E412)","v":{"$error":"#REF!"}}]
["170563AO",170563,"17.12.0084","RYAN ARYANDI","17.12.0084",{"$f":"COUNTIF(#REF!,E413)","v":{"$error":"#REF!"}}]
["170377AO",170377,"17.12.0086","ERIANA ZAHROTUL FIRDAUS","17.12.0086",{"$f":"COUNTIF(#REF!,E414)","v":{"$error":"#REF!"}}]
["170559AO",170559,"17.12.0087","SEPTIAN ILHAM SANTOSA","17.12.0087",{"$f":"COUNTIF(#REF!,E415)","v":{"$error":"#REF!"}}]
["170473AO",170473,"17.12.0088","VITA LISTIA ANDANI","17.12.0088",{"$f":"COUNTIF(#REF!,E416)","v":{"$error":"#REF!"}}]
["170227AO",170227,"17.12.0089","FATIN MUSTIKA SARI","17.12.0089",{"$f":"COUNTIF(#REF!,E417)","v":{"$error":"#REF!"}}]
["170542AO",170542,"17.12.0090","ABDUL GOFUR","17.12.0090",{"$f":"COUNTIF(#REF!,E418)","v":{"$error":"#REF!"}}]
["170541AO",170541,"17.12.0091","KELLY DHINA ARYANITA","17.12.0091",{"$f":"COUNTIF(#REF!,E419)","v":{"$error":"#REF!"}}]
["170603AO",170603,"17.12.0092","DEADRA IVANKA NAILUFAR","17.12.0092",{"$f":"COUNTIF(#REF!,E420)","v":{"$error":"#REF!"}}]
["170387AO",170387,"17.12.0094","DIKA NOER MUHAMAD FATAH","17.12.0094",{"$f":"COUNTIF(#REF!,E421)","v":{"$error":"#REF!"}}]
["170566AO",170566,"17.12.0095","SISKA PUTRI UTAMI","17.12.0095",{"$f":"COUNTIF(#REF!,E422)","v":{"$error":"#REF!"}}]
["170470AO",170470,"17.12.0096","DEPPI PUSPITASARI","17.12.0096",{"$f":"COUNTIF(#REF!,E423)","v":{"$error":"#REF!"}}]
["170570AO",170570,"17.12.0097","MOHAMAD FAISAL","17.12.0097",{"$f":"COUNTIF(#REF!,E424)","v":{"$error":"#REF!"}}]
["170620AO",170620,"17.12.0098","DWI MEILIANA","17.12.0098",{"$f":"COUNTIF(#REF!,E425)","v":{"$error":"#REF!"}}]
["170195AO",170195,"17.12.0099","MUHAMMAD ASEP ROSYADI","17.12.0099",{"$f":"COUNTIF(#REF!,E426)","v":{"$error":"#REF!"}}]
["170382AO",170382,"17.12.0100","HERAYA FITRA","17.12.0100",{"$f":"COUNTIF(#REF!,E427)","v":{"$error":"#REF!"}}]
["170343AO",170343,"17.12.0101","TRI SEPTI WIDI YANTI","17.12.0101",{"$f":"COUNTIF(#REF!,E428)","v":{"$error":"#REF!"}}]
["170215AO",170215,"17.12.0102","LEIN ITA NURBAETY","17.12.0102",{"$f":"COUNTIF(#REF!,E429)","v":{"$error":"#REF!"}}]
["170308AO",170308,"17.12.0103","RYAN IBNU RIZKYARDHANA","17.12.0103",{"$f":"COUNTIF(#REF!,E430)","v":{"$error":"#REF!"}}]
["170496AO",170496,"17.12.0104","WAHYU ANANG SUBEKTI","17.12.0104",{"$f":"COUNTIF(#REF!,E431)","v":{"$error":"#REF!"}}]
["170249AO",170249,"17.12.0105","I NYOMAN PUTHUT WIJAYA","17.12.0105",{"$f":"COUNTIF(#REF!,E432)","v":{"$error":"#REF!"}}]
["170500AO",170500,"17.12.0106","MUHAMAD FAQIH RIDHO","17.12.0106",{"$f":"COUNTIF(#REF!,E433)","v":{"$error":"#REF!"}}]
["170575AO",170575,"17.12.0107","DIMAS GONDO UTOMO","17.12.0107",{"$f":"COUNTIF(#REF!,E434)","v":{"$error":"#REF!"}}]
["170295AO",170295,"17.12.0108","FAIZ ZURRAHMAN AS SIROZ","17.12.0108",{"$f":"COUNTIF(#REF!,E435)","v":{"$error":"#REF!"}}]
["170141AO",170141,"17.12.0109","HANINDYA SEKAR PUTRI","17.12.0109",{"$f":"COUNTIF(#REF!,E436)","v":{"$error":"#REF!"}}]
["170090AO",170090,"17.12.0110","ANKGRAENI KUSUMA DEWI","17.12.0110",{"$f":"COUNTIF(#REF!,E437)","v":{"$error":"#REF!"}}]
["170243AO",170243,"17.12.0111","AMELIA MAWADDAH ALFATHANI","17.12.0111",{"$f":"COUNTIF(#REF!,E438)","v":{"$error":"#REF!"}}]
["170466AO",170466,"17.12.0112","MALDI SAVARA HIDAYAT","17.12.0112",{"$f":"COUNTIF(#REF!,E439)","v":{"$error":"#REF!"}}]
["170613AO",170613,"17.12.0113","AJI PANGESTU","17.12.0113",{"$f":"COUNTIF(#REF!,E440)","v":{"$error":"#REF!"}}]
["170453AO",170453,"17.12.0114","NAAN DAYUNA","17.12.0114",{"$f":"COUNTIF(#REF!,E441)","v":{"$error":"#REF!"}}]
["170565AO",170565,"17.12.0115","HANDIKA AJI SAPUTRA","17.12.0115",{"$f":"COUNTIF(#REF!,E442)","v":{"$error":"#REF!"}}]
["170608AO",170608,"17.12.0116","ELFARIANI MIFTAKHUL JANAH","17.12.0116",{"$f":"COUNTIF(#REF!,E443)","v":{"$error":"#REF!"}}]
["170392AO",170392,"17.12.0117","IVAN ZAKA MUBAROK","17.12.0117",{"$f":"COUNTIF(#REF!,E444)","v":{"$error":"#REF!"}}]
["170410AO",170410,"17.12.0118","AMELIA PUTRIYANI","17.12.0118",{"$f":"COUNTIF(#REF!,E445)","v":{"$error":"#REF!"}}]
["170627AO",170627,"17.12.0119","ASRIL FAUZI NURHAKIM","17.12.0119",{"$f":"COUNTIF(#REF!,E446)","v":{"$error":"#REF!"}}]
["170536AO",170536,"17.12.0120","ERADIKA REZA LUTFIANSYAH","17.12.0120",{"$f":"COUNTIF(#REF!,E447)","v":{"$error":"#REF!"}}]
["170581AO",170581,"17.12.0121","BUDI KURNIAWAN","17.12.0121",{"$f":"COUNTIF(#REF!,E448)","v":{"$error":"#REF!"}}]
["170042AO",170042,"17.12.0122","ESA DAMAYANTI","17.12.0122",{"$f":"COUNTIF(#REF!,E449)","v":{"$error":"#REF!"}}]
["170083AO",170083,"17.12.0123","FARRIS AMRULLAH","17.12.0123",{"$f":"COUNTIF(#REF!,E450)","v":{"$error":"#REF!"}}]
["170149AO",{"$f":"VALUE(LEFT(A451,6))","v":170149},"17.12.0126","MUHAMAD WELLY PRAYOGA",{"$f":"C451","v":"17.12.0126"},{"$f":"COUNTIF(#REF!,E451)","v":{"$error":"#REF!"}}]
["170355AO",170355,"17.12.0129","RAHMI SARI FAUZIYAH","17.12.0129",{"$f":"COUNTIF(#REF!,E452)","v":{"$error":"#REF!"}}]
["170354AO",170354,"17.12.0130","RAHMA SARI FAUZIYAH","17.12.0130",{"$f":"COUNTIF(#REF!,E453)","v":{"$error":"#REF!"}}]
["170488AO",170488,"17.12.0131","RUDI AGUS PRAPTOMO","17.12.0131",{"$f":"COUNTIF(#REF!,E454)","v":{"$error":"#REF!"}}]
["170615AO",170615,"17.12.0132","DIKKA SANY ARGIA","17.12.0132",{"$f":"COUNTIF(#REF!,E455)","v":{"$error":"#REF!"}}]
["170622AO",170622,"17.12.0133","MUHAMAD ALIF ALFARIZKI","17.12.0133",{"$f":"COUNTIF(#REF!,E456)","v":{"$error":"#REF!"}}]
["170366AO",170366,"17.12.0134","SITI AMALIAH","17.12.0134",{"$f":"COUNTIF(#REF!,E457)","v":{"$error":"#REF!"}}]
["170644AO",170644,"17.12.0135","INDAH GHINA SHAFIRA WARDHANY","17.12.0135",{"$f":"COUNTIF(#REF!,E458)","v":{"$error":"#REF!"}}]
["170352AO",170352,"17.12.0136","DHIMAS BANYU PERWITA","17.12.0136",{"$f":"COUNTIF(#REF!,E459)","v":{"$error":"#REF!"}}]
["170405AO",170405,"17.12.0137","SEPTA AGENG NUGROHO","17.12.0137",{"$f":"COUNTIF(#REF!,E460)","v":{"$error":"#REF!"}}]
["170495AO",170495,"17.12.0138","ANGGI RIZKA UTAMI","17.12.0138",{"$f":"COUNTIF(#REF!,E461)","v":{"$error":"#REF!"}}]
["170523AO",170523,"17.12.0140","INDIKA MANGGALA PUTRA","17.12.0140",{"$f":"COUNTIF(#REF!,E462)","v":{"$error":"#REF!"}}]
["170650AO",170650,"17.12.0141","ZURAIDA YUNIAR FIRDAUS","17.12.0141",{"$f":"COUNTIF(#REF!,E463)","v":{"$error":"#REF!"}}]
["170328AO",170328,"17.12.0142","IKBAL GALIH NURPAMUNGKAS","17.12.0142",{"$f":"COUNTIF(#REF!,E464)","v":{"$error":"#REF!"}}]
["170516AO",170516,"17.12.0143","DEA ROMI ANGGRAENI","17.12.0143",{"$f":"COUNTIF(#REF!,E465)","v":{"$error":"#REF!"}}]
["170631AO",170631,"17.12.0144","MUSLIM ADILAH","17.12.0144",{"$f":"COUNTIF(#REF!,E466)","v":{"$error":"#REF!"}}]
["170278AO",170278,"17.12.0145","YULISTIANA DEWI","17.12.0145",{"$f":"COUNTIF(#REF!,E467)","v":{"$error":"#REF!"}}]
["170474AO",170474,"17.12.0146","FARINDA EKA PUTRI","17.12.0146",{"$f":"COUNTIF(#REF!,E468)","v":{"$error":"#REF!"}}]
["170616AO",170616,"17.12.0147","IDA LAENI","17.12.0147",{"$f":"COUNTIF(#REF!,E469)","v":{"$error":"#REF!"}}]
["170525AO",170525,"17.12.0148","ALVIAN MAJID","17.12.0148",{"$f":"COUNTIF(#REF!,E470)","v":{"$error":"#REF!"}}]
["170323AO",170323,"17.12.0149","EVI SINDYANTI","17.12.0149",{"$f":"COUNTIF(#REF!,E471)","v":{"$error":"#REF!"}}]
["170389AO",170389,"17.12.0150","UGA SYAHRIL RAMADHAN","17.12.0150",{"$f":"COUNTIF(#REF!,E472)","v":{"$error":"#REF!"}}]
["170543AO",170543,"17.12.0151","NAELLA FAUZIATUL ABSONI","17.12.0151",{"$f":"COUNTIF(#REF!,E473)","v":{"$error":"#REF!"}}]
["170318AO",170318,"17.12.0152","DISTA TRIANISFI","17.12.0152",{"$f":"COUNTIF(#REF!,E474)","v":{"$error":"#REF!"}}]
["170075AO",170075,"17.12.0153","FIRMAN WIJAYA","17.12.0153",{"$f":"COUNTIF(#REF!,E475)","v":{"$error":"#REF!"}}]
["170168AO",170168,"17.12.0154","DEWI SULISTYOWATI","17.12.0154",{"$f":"COUNTIF(#REF!,E476)","v":{"$error":"#REF!"}}]
["170273AO",170273,"17.12.0155","M.NAFI FANAULKIROM","17.12.0155",{"$f":"COUNTIF(#REF!,E477)","v":{"$error":"#REF!"}}]
["170334AO",170334,"17.12.0156","GIRI INDAH UMBARAWATI","17.12.0156",{"$f":"COUNTIF(#REF!,E478)","v":{"$error":"#REF!"}}]
["170661AO",170661,"17.12.0157","REGI FEBRIAN R","17.12.0157",{"$f":"COUNTIF(#REF!,E479)","v":{"$error":"#REF!"}}]
["170586AO",170586,"17.12.0158","TANJUNG ISNANTIA KENJI","17.12.0158",{"$f":"COUNTIF(#REF!,E480)","v":{"$error":"#REF!"}}]
["170190AO",170190,"17.12.0159","ANISA UMMUL LATIFAH","17.12.0159",{"$f":"COUNTIF(#REF!,E481)","v":{"$error":"#REF!"}}]
["170373AO",170373,"17.12.0160","HABIBBULLOH ROSYID RIDHO UMARSUM MANSYUR SYAH","17.12.0160",{"$f":"COUNTIF(#REF!,E482)","v":{"$error":"#REF!"}}]
["170665AO",170665,"17.12.0161","EDO SAHPUTRA","17.12.0161",{"$f":"COUNTIF(#REF!,E483)","v":{"$error":"#REF!"}}]
["170286AO",170286,"17.12.0162","YUDITYA HARI NUGROHO","17.12.0162",{"$f":"COUNTIF(#REF!,E484)","v":{"$error":"#REF!"}}]
["170562AO",170562,"17.12.0163","MUJIBUROKHMAN","17.12.0163",{"$f":"COUNTIF(#REF!,E485)","v":{"$error":"#REF!"}}]
["170404AO",170404,"17.12.0164","EDI RIANTO","17.12.0164",{"$f":"COUNTIF(#REF!,E486)","v":{"$error":"#REF!"}}]
["170507AO",170507,"17.12.0165","NAUFAL MAULANA ANBIYA","17.12.0165",{"$f":"COUNTIF(#REF!,E487)","v":{"$error":"#REF!"}}]
["170630AO",170630,"17.12.0166","MOHAMMAD RAYHAN ALMADANI","17.12.0166",{"$f":"COUNTIF(#REF!,E488)","v":{"$error":"#REF!"}}]
["170643AO",170643,"17.12.0167","MARWAN SETIANGGORO","17.12.0167",{"$f":"COUNTIF(#REF!,E489)","v":{"$error":"#REF!"}}]
["170368AO",170368,"17.12.0168","RINGO ADAM B.A","17.12.0168",{"$f":"COUNTIF(#REF!,E490)","v":{"$error":"#REF!"}}]
["170228AO",170228,"17.12.0169","MARIA SEKAR ANJANI","17.12.0169",{"$f":"COUNTIF(#REF!,E491)","v":{"$error":"#REF!"}}]
["170590AO",170590,"17.12.0170","NAUVAL FAHMI ESA SULISTIANA","17.12.0170",{"$f":"COUNTIF(#REF!,E492)","v":{"$error":"#REF!"}}]
["170632AO",170632,"17.12.0171","IMAM KHADAFI","17.12.0171",{"$f":"COUNTIF(#REF!,E493)","v":{"$error":"#REF!"}}]
["170442AO",170442,"17.12.0172","TATA SALANJAR GUSTINADI","17.12.0172",{"$f":"COUNTIF(#REF!,E494)","v":{"$error":"#REF!"}}]
["170420AO",170420,"17.12.0173","WILUJENG PURNOMO ANGKADI","17.12.0173",{"$f":"COUNTIF(#REF!,E495)","v":{"$error":"#REF!"}}]

{"sheet":"Sheet2","index":2,"n_rows":692,"n_cols":9,"rows_kept":692,"hidden":true}
["KELOMPOK PELATIHAN SUPER UNGGUL (PSU)"]
["KELOMPOK A.1 ( Ruang AULA )"]
["RABU, 10 MEI 2017"]
["09.00 - 13.00"]
[]
["NO.","NO.DAF","NAMA","PRODI","JENIS","PARAF"]
[{"$nulls":4},"KELAMIN"]
[1,170014,"ABDUL GHOFUR","TI","L",1,null,"17.11.0047","A"]
[2,170038,"ACHMAD DIAN RAFI'I","TI SORE","L",null,2,"17.11.0049","B"]
[3,170003,"ADIT TRI SEPTIAWAN","TI","L",3,null,"17.11.0243","B"]
[4,170052,"AFFAN AZ ZARQONI","TI","L",null,4,"17.11.0032","C"]
[5,170050,"AFREL PUTRA MAHENDRA","TI","L",5,null,"17.11.0042","A"]
[6,170031,"ANINDYA ANGGELINA","SI","P",null,6,"17.12.0012","A"]
[7,170018,"ARI NUR RIZKI","TI","L",7,null,"17.11.0048","A"]
[8,170047,"BAGAS WARDANA","SI","L",null,8,"17.12.0002","B"]
[9,170008,"BIMA RASENDRIYA INDRASTOTO","TI","L",9,null,"17.11.0006","A"]
[10,170009,"CANDRA NOVIAN","SI","L",null,10,"17.12.0005","A"]
[11,170039,"CHINTIA DINI PRATIWI","SI","P",11,null,{"$error":"#N/A"},"D"]
[12,170002,"DAFFA RIZQI ANDRIAN","TI","L",null,12,"17.11.0028","A"]
[13,170040,"DEBI INDARTO","TI","L",13,null,"17.11.0015","A"]
[14,170025,"DIMAS AJI PRASETYO","TI","L",null,14,"17.11.0242","A"]
[15,170001,"DITA FERDIAN BAYU KUSUMA","TI","L",15,null,"17.11.0001","B"]
[16,170041,"EKY SETIAWAN","SI","L",null,16,"17.12.0003","A"]
[17,170035,"ENTUK AJI NUGROHO","TI","L",17,null,"17.11.0030","A"]
[18,170004,"GAGAT BASKORO SYAH","TI SORE","L",null,18,"17.11.0073","A"]
[19,170019,"GILANG RIZKY MUSTOFA","TI","L",19,null,"17.11.0191","C"]
[20,170012,"IFANIA OKTAVIANI PUTRI","SI","P",null,20,"17.12.0011","A"]
[21,170032,"IVAN SURYA WITANTO","TI SORE","L",21,null,"17.11.0337","C"]
[22,170178,"JALUMIYOS RAMADHIANSYAH","TI","L",null,22,"17.12.0065","A"]
[23,170024,"JANUARIO SUBECTI BANO","TI SORE","L",23,null,"17.11.0003","D"]
[24,170023,"LABIB FAUZI RAMADAN","TI","L",null,24,"17.11.0004","A"]
[25,170049,"LAELATUL ROFIDA","TI","P",25,null,"17.11.0012","A"]
[26,170037,"MOHAMAD BAGUS WIDIYANTO","TI SORE","L",null,26,"17.11.0011","C"]
[27,170026,"NANA SABRINA","TI","P",27,null,"17.11.0005","A"]
[28,170017,"NUR LAELI RACHMAWATI","SI","P",null,28,"17.12.0001","A"]
[29,170183,"NUR ROCHMAN ALFATONI","TI","L",29,null,"17.11.0068","A"]
[30,170016,"RANGGA GUSTI ANANTA","TI SORE","L",null,30,"17.11.0007","C"]
[31,170066,"RANGGA PRANGWEDAWA JANUWARSA","TI","L",31,null,"17.11.0013","C"]
[32,170021,"RIAN PRIADI","TI SORE","L",null,32,"17.11.0043","A"]
[33,170020,"RIYAN EKO SAPUTRA","TI SORE","L",33,null,"17.11.0010","D"]
[34,170006,"RIZQI MUSTHOFA","TI","L",null,34,"17.11.0002","A"]
[35,170022,"SUSANTO ","TI SORE","L",35,null,"17.11.0009","A"]
[]
[]
[]
["KELOMPOK PELATIHAN SUPER UNGGUL (PSU)"]
["KELOMPOK B.1 ( Ruang 2.1 )"]
["RABU, 10 MEI 2017"]
["09.00 - 13.00"]
[]
["NO.","NO.DAF","NAMA","PRODI","JENIS","PARAF"]
[{"$nulls":4},"KELAMIN"]
[1,170015,"ADAM AMIRUDIN","TI","L",1,null,"17.11.0046","A"]
[2,170092,"AFIF MA'RUF ESKA","TI","L",null,2,"17.11.0020","A"]
[3,170064,"ALFIAN KUKUH ADITAMA","TI","L",3,null,"17.11.0229","A"]
[4,170063,"APRILIA MELI KRISTINA","SI","P",null,4,"17.12.0067","A"]
[5,170053,"ARIF SUPRIYONO","TI","L",5,null,"17.11.0044","A"]
[6,170072,"ASEP SETIAJI","TI","L",null,6,"17.11.0024","A"]
[7,170030,"CANDRA YANUAR DWI NURCAHYO","TI SORE","L",7,null,"17.11.0019","A"]
[8,170060,"DARMORO WINANJAR SASMIKO","TI SORE","L",null,8,"17.11.0023","D"]
[9,170055,"DEDY ISTIYADI PUJIANANDA","TI SORE","L",9,null,"17.11.0033","A"]
[10,170042,"ESA DAMAYANTI","SI","P",null,10,"17.12.0122","D"]
[11,170083,"FARRIS AMRULLAH","SI","L",11,null,"17.12.0123","A"]
[12,170045,"FAUZAN AJI ","TI SORE","L",null,12,"17.11.0034","A"]
[13,170062,"FIQRI OCKAS PERDANA","TI","L",13,null,"17.11.0050","B"]
[14,170034,"JUAN SEBACHTIAN","TI SORE","L",null,14,"17.11.0037","A"]
[15,170082,"KURNIAWAN SAPUTRA","TI","L",15,null,"17.11.0018","A"]
[16,170068,"MOHAMMAD RIZALDI PRADANA","TI","L",null,16,"17.11.0162","A"]
[17,170089,"MUHAMAD MACHFUDZ ALDIANSYAH","SI","L",17,null,"17.11.0186","A"]
[18,170061,"PURBO DWI ANGGORO","TI","L",null,18,"17.11.0245","B"]
[19,170071,"PUTU LEO KHARISMA BANGSA","TI","L",19,null,"17.11.0027","D"]
[20,170076,"REFIANTO RIZKY CANDRA S","TI","L",null,20,{"$error":"#N/A"},"B"]
[21,170077,"RIJAL AMRI MAJID ","TI","L",21,null,"17.11.0248","A"]
[22,170078,"RIZAL RENALDO","TI","L",null,22,{"$error":"#N/A"},"D"]
[23,170067,"ROFI SUSI NUR FATIMAH","SI","P",23,null,"17.12.0009","A"]
[24,170073,"SEPTIAN PRIMANSYAH","TI","L",null,24,"17.11.0014","A"]
[25,170057,"SETYO PRIMA AJI","TI","L",25,null,"17.11.0297","B"]
[26,170074,"SUKRON ANASIR","TI SORE","L",null,26,{"$error":"#N/A"},"A"]
[27,170059,"WAHYU SURYO NUROHMAN","TI","L",27,null,"17.11.0244","A"]
[28,170084,"WHISNU ADAM FATHURROKHMAN","TI","L",null,28,"17.11.0247","A"]
[29,170070,"WISNU PRASETYA","TI SORE","L",29,null,"17.11.0031","A"]
[30,170069,"YUSUF SUPRIYATNA","TI","L",null,30,"17.11.0017","A"]
[31,170168,"DEWI SULISTIYOWATI","TI SORE","P",31,null,"17.12.0154","A"]
[32,170037,"MOHAMAD BAGUS WIDIYANTO","TI SORE","L",null,32,"17.11.0011","A"]
[33,170052,"AFFAN AZ ZARQONI","TI","L",33,null,"17.11.0032","A"]
[34,170161,"ADE TRIO PAMUNGKAS","TI SORE","L",null,34,"17.11.0308","A"]
[{"$nulls":7},{"$error":"#N/A"}]
[{"$nulls":7},{"$error":"#N/A"}]
[{"$nulls":7},{"$error":"#N/A"}]
[]
["KELOMPOK PELATIHAN SUPER UNGGUL (PSU)"]
["KELOMPOK A.2 ( Ruang AULA )"]
["RABU, 10 MEI 2017"]
["13.00 - 17.00"]
[]
["NO.","NO.DAF","NAMA","PRODI","JENIS","PARAF"]
[{"$nulls":4},"KELAMIN"]
[1,170133,"ACHMAD FERDIYANSYAH","TI","L",1,null,"17.11.0286","A"]
[2,170109,"ADE IVAN VANANI","SI","L",null,2,"17.12.0016","B"]
[3,170128,"ADI BUDI PRASETYO","TI","L",3,null,"17.11.0167","A"]
[4,170122,"AFIFUR ROHMAN ZAIN","SI","L",null,4,"17.12.0017","A"]
[5,170096,"AHMAD ALWI RAHMAN","TI","L",5,null,"17.11.0029","B"]
[6,170126,"ALDILIYA AINUN MADJID","TI","L",null,6,"17.11.0130","A"]
[7,170051,"ARIEF KURNIA RAMADHANI","TI","L",7,null,"17.11.0016","A"]
[8,170101,"AURORA DWI KHATULISTIAN","TI","L",null,8,"17.11.0022","D"]
[9,170111,"CHRISTIANTO TRI MULYANTO PUTRA","TI","L",9,null,"17.11.0026","B"]
[10,170132,"DEFRIA ISKANTO","TI","L",null,10,"17.11.0040","A"]
[11,170113,"FADHLAN NUR KHAALISH","SI","L",11,null,"17.12.0014","A"]
[12,170160,"FARIS KELVIANTO","TI","L",null,12,"17.11.0035","A"]
[13,170141,"HANINDYA SEKAR PUTRI","SI","P",13,null,"17.12.0109","D"]
[14,170125,"IFHAM MAFTOKHIN","SI","L",null,14,"17.12.0010","A"]
[15,170156,"KARTIKO HAYAT NUGROHO","TI","L",15,null,"17.11.0062","B"]
[16,170058,"KHAIDIR NALAKHUDIN","TI SORE","L",null,16,"17.11.0298","B"]
[17,170116,"KRISNO","TI","L",17,null,"17.11.0036","A"]
[18,170110,"LISNA YANUAR MUKHLIS","TI","L",null,18,"17.11.0066","A"]
[19,170120,"LUTFI ERIYAN","TI","L",19,null,"17.11.0051","A"]
[20,170097,"LUTHFIYA HATI ISLAMI","SI","P",null,20,{"$error":"#N/A"},"B"]
[21,170144,"MEI ANGGUN TRIANA","TI","P",21,null,{"$error":"#N/A"},"A"]
[22,170086,"NABILA APRILIANTI","SI","P",null,22,"17.12.0068","A"]
[23,170107,"NURAZIS ADHIRAMA PAMUNGKAS","TI","L",23,null,"17.11.0038","A"]
[24,170115,"RAHILA NUR JANAH","TI","P",null,24,"17.11.0025","A"]
[25,170099,"SAKTIANA ARIFFATUN NISA","TI SORE","P",25,null,{"$error":"#N/A"},"D"]
[26,170151,"SHAFRIAL AZHAR","TI","L",null,26,"17.11.0328","B"]
[27,170112,"SIDIK BAHTIAR","SI","L",27,null,"17.12.0008","D"]
[28,170105,"SITI KHUMAEROH","SI","P",null,28,"17.12.0007","A"]
[29,170141,"SONI GUNAWAN ZEN","SI","L",29,null,"17.12.0109","A"]
[30,170150,"TRIYONO","TI","L",null,30,"17.11.0039","A"]
[31,170048,"TUTI SUPRIATININGSIH","TI SORE","P",31,null,"17.11.0318","A"]
[32,170065,"UTAMI DINI PUSPITA","TI","P",null,32,"17.11.0180","A"]
[33,170124,"YOGA EKO PUJIANTO","SI","L",33,null,{"$error":"#N/A"},"A"]
[34,170119,"YULIANDRI SETIADI","TI","L",null,34,"17.11.0250","C"]
[35,170108,"ZULFA AULIA","SI","P",35,null,"17.12.0006","A"]
[36,170155,"MOCH. ATANAL YAQIN","TI","L",null,36,"17.11.0063","A"]
[37,170156,"AHMAD HISYAM ADNAN","TI","L",37,null,"17.11.0062","A"]
[]
["KELOMPOK PELATIHAN SUPER UNGGUL (PSU)"]
["KELOMPOK B.2 ( Ruang 2.1 )"]
["RABU, 10 MEI 2017"]
["13.00-17.00"]
[]
["NO.","NO.DAF","NAMA","PRODI","JENIS","PARAF"]
[{"$nulls":4},"KELAMIN"]
[1,170149,"WAHYU BUDI PRAKOSO","TI","LAKI-LAKI",1,null,"17.12.0126","A"]
[2,170148,"RIFKI LESTIANTO","TI","LAKI-LAKI",null,2,"17.11.0041","A"]
[3,170163,"WILDAN MUBAROK AZZAKKI","TI","LAKI-LAKI",3,null,"17.11.0225","A"]
[4,170152,"FARA NOVI ANA","TI","PEREMPUAN",null,4,"17.11.0290","D"]
[5,170148,"MUHAMAD WELLY PRAYOGA","SI","LAKI-LAKI",5,null,"17.11.0041","A"]
[6,170176,"ILHAM HAQQI WIJAYA","TI","LAKI-LAKI",null,6,"17.12.0020","A"]
[7,170196,"YASMIN BUDIWATI","SI","PEREMPUAN",7,null,"17.11.0273","A"]
[8,170165,"FIQRI ADRIANSYAH","TI","LAKI-LAKI",null,8,"17.11.0305","A"]
[9,170189,"YOGA MAULANA","TI","LAKI-LAKI",9,null,"17.11.0159","A"]
[10,170169,"DEDE IRAWAN","TI","LAKI-LAKI",null,10,"17.11.0164","A"]
[11,170200,"BAHARUDDIN AL FADHILAH","TI","LAKI-LAKI",11,null,"17.11.0072","B"]
[12,170185,"ADHI LATIEF MUKTIANA","TI","LAKI-LAKI",null,12,"17.11.0193","A"]
[13,170204,"ADITYA DAMARJATI","TI","LAKI-LAKI",13,null,"17.11.0197","A"]
[14,170182,"FAISAL RIYADI","TI","LAKI-LAKI",null,14,"17.11.0136","A"]
[15,170168,"MUKJIZAT SETIO NUGROHO","TI","LAKI-LAKI",15,null,"17.12.0154","A"]
[16,170168,"DEWI SULISTYOWATI ","TI SORE","PEREMPUAN",null,16,"17.12.0154","D"]
[17,170181,"ARJUNTORO ARDHY FERDIAN","SI","LAKI-LAKI",17,null,"17.12.0039","A"]
[18,170204,"MOHAMMAD SHOFYAN FAURI","TI","LAKI-LAKI",null,18,"17.11.0197","A"]
[19,170192,"IRVAN EKA ZAENALDI","TI","LAKI-LAKI",19,null,"17.12.0018","A"]
[20,170161,"TRI SETYARANI DEWI","TI SORE","PEREMPUAN",null,20,"17.11.0308","A"]
[21,170177,"AULIA PUSPITA ANTARUSMARA","SI","PEREMPUAN",21,null,"17.11.0338","A"]
[22,170189,"ANISA UMMUL LATIFAH","SI","PEREMPUAN",null,22,"17.11.0159","D"]
[23,170176,"IKHFANDA DWI PURNOMO","TI","LAKI-LAKI",23,null,"17.12.0020","A"]
[24,170172,"AI FADJAR ALDIADI","TI","LAKI-LAKI",null,24,"17.12.0037","A"]
[25,170163,"ADE PRASTYO","TI","LAKI-LAKI",25,null,"17.11.0225","A"]
[26,170046,"HANA AMBAR FATIK WIBAWA ","SI","PEREMPUAN",null,26,"17.12.0077","A"]
[27,170160,"ADE TRIO PAMUGKAS","TI SORE","LAKI-LAKI",27,null,"17.11.0035","D"]
[28,170094,"MUHAMMAD GHOZY LATHIF","TI SORE","LAKI-LAKI",null,28,"17.11.0240","C"]
[29,170095,"SOLEH NUR HAYAT","TI SORE","LAKI-LAKI",29,null,"17.11.0021","A"]
[30,170139,"LAELI NUR HIDAYATI",null,"PEREMPUAN",null,30,"17.11.0252","D"]
[31,170174,"M. IRFANI MUSA",null,"LAKI-LAKI",31,null,"17.11.0253","A"]
[32,170200,"BAHARUDIN AI",null,"LAKI-LAKI",null,32,"17.11.0072","C"]
[33,170136,"ALDI SETIA",null,"LAKI-LAKI",33,null,"17.11.0057","A"]
[34,170123,"AGUNG BUDI P","TI","LAKI-LAKI",null,34,"17.11.0227","A"]
[35,170117,"DITA PURNAMASARI","TI","PEREMPUAN",35,null,"17.11.0045","A"]
[36,null,"NOVA PRASETIYO","TI","LAKI-LAKI",null,36,{"$error":"#N/A"},"A"]
[37,170192,"AZHARI RAHMAT B","SI","LAKI-LAKI",37,null,"17.12.0018","A"]
[]
[]
["KELOMPOK PELATIHAN SUPER UNGGUL (PSU)"]
["KELOMPOK A.1 ( Ruang AULA )"]
["JUMAT, 07 Juli 2017"]
["08.00 - 11.00 WIB"]
[]
["NO.","NO.DAF","NAMA","PRODI","JENIS","PARAF"]
[{"$nulls":4},"KELAMIN"]
[1,170075,"FIRMAN WIJAYA","SI","LAKI-LAKI",1,null,"17.12.0153","A"]
[2,170184,"ANDRIANUS AGUNG NUGROHO","TI","LAKI-LAKI",null,2,"17.11.0287","A"]
[3,170007,"AZIZAN NURHAKIM","TI","LAKI-LAKI",3,null,"17.11.0008","A"]
[4,170212,"IHWAN PRASETIO","TI","LAKI-LAKI",null,4,"17.12.0021","D"]
[5,170197,"M.FIQIH FADLI ILMAWAN","SI","LAKI-LAKI",5,null,"17.12.0015","A"]
[6,170139,"LAELI NUR HIDAYATI","TI","PEREMPUAN",null,6,"17.11.0252","A"]
[7,170103,"ZURNAEN EVAN ZIZA RIADHI","TI","LAKI-LAKI",7,null,"17.11.0055","D"]
[8,170104,"FAISAL ISKA UKHRIZA","TI","LAKI-LAKI",null,8,"17.11.0056","D"]
[9,170227,"MARIA SEKAR ANJANI","SI","PEREMPUAN",9,null,"17.12.0089","A"]
[10,170127,"SIMON SOFIAN IWAN WIBOWO","TI","LAKI-LAKI",null,10,"17.11.0079","D"]
[11,170224,"DWI JOKO PURNOMO","TI","LAKI-LAKI",11,null,"17.11.0078","A"]
[12,170230,"REIYVAL WILIM PRATAMA","TI","LAKI-LAKI",null,12,"17.11.0270","D"]
[13,170211,"MOCHAMMAD OBBY SYECH FRUDDIN","SI","LAKI-LAKI",13,null,"17.12.0030","A"]
[14,170173,"RINA ELMI SOFIANA","TI","PEREMPUAN",null,14,"17.11.0168","D"]
[15,170237,"ALFANDI RIFQI WIDYADANA","TI","LAKI-LAKI",15,null,"17.11.0100","A"]
[16,170164,"WISNU PAMUNGKAS","TI","LAKI-LAKI",null,16,"17.11.0196","D"]
[17,170123,"AGUNG BUDI PRASETYO","TI SORE","LAKI-LAKI",17,null,"17.11.0227","D"]
[18,170136,"ALDI SETIA PAMBUDI","TI","LAKI-LAKI",null,18,"17.11.0057","D"]
[19,170117,"DITA PURNAMASARI","TI","PEREMPUAN",19,null,"17.11.0045","A"]
[20,170207,"IMAM SYAFII","TI SORE","LAKI-LAKI",null,20,"17.11.0053","A"]
[21,170114,"MASADI DWI KURNIAWAN","TI","LAKI-LAKI",21,null,"17.11.0314","A"]
[22,170224,"TRI MUJI RAHAYU","TI","PEREMPUAN",null,22,"17.11.0078","A"]
[23,170187,"NOVA PRASETIYO","TI","LAKI-LAKI",23,null,{"$error":"#N/A"},"D"]
[24,170238,"HERMAWAN DWI PRAYITNO","TI","LAKI-LAKI",null,24,"17.11.0099","A"]
[25,170205,"FITA DWI LESTARI","SI","PEREMPUAN",25,null,"17.11.0194","A"]
[26,170232,"JULI MAULANA","TI","LAKI-LAKI",null,26,"17.11.0329","A"]
[27,170246,"ZSA ZSA GRACIA SUPRIANTO","SI","PEREMPUAN",27,null,"17.11.0058","A"]
[28,170216,"ANWAR BUDHI DHARMAWAN","TI","LAKI-LAKI",null,28,"17.12.0023","A"]
[29,170246,"TRI HASTOMO","TI","LAKI-LAKI",29,null,"17.11.0058","A"]
[30,170221,"BELLA AGUSTIA","TI","PEREMPUAN",null,30,"17.12.0038","A"]
[31,170215,"LEIN ITA NURBAETY","SI","PEREMPUAN",31,null,"17.12.0102","A"]
[32,170202,"FAZRI JATI HUMANIKA","TI","LAKI-LAKI",null,32,"17.11.0254","A"]
[33,170242,"AMELIA MAWADDAH ALFATHANI","SI","PEREMPUAN",33,null,"17.12.0032","A"]
[34,170235,"HUSNI HAMZAH","TI","LAKI-LAKI",null,34,"17.11.0114","A"]
[35,170239,"DESTY SANDRA UTAMI","SI","PEREMPUAN",35,null,"17.11.0087","A"]
[36,170300,"AMMAR SHOLEH ARYANTO","TI","LAKI-LAKI",null,36,"17.12.0035","A"]
[37,170251,"NAUFAL GUSNI JANUNG PANGKAR","TI","LAKI-LAKI",37,null,"17.11.0070","A"]
[{"$nulls":7},{"$error":"#N/A"}]
[{"$nulls":7},{"$error":"#N/A"}]
[]
["KELOMPOK PELATIHAN SUPER UNGGUL (PSU)"]
["KELOMPOK B.1 ( Ruang 2.1 )"]
["JUMAT, 07 Juli 2017"]
["08.00 - 11.00 Wib"]
[]
["NO.","NO.DAF","NAMA","PRODI","JENIS","PARAF"]
[{"$nulls":4},"KELAMIN"]
[1,170342,"ARIF SUGIARTO","TI","LAKI-LAKI",1,null,"17.12.0025","A"]
[2,170275,"ELIAS NABIL","TI","LAKI-LAKI",null,2,"17.11.0148","B"]
[3,170286,"MIQDAR ALFI SYAHRIN","SI","PEREMPUAN",3,null,"17.12.0162","A"]
[4,170315,"ALDISTYA RIESTA SEKARINI","SI","PEREMPUAN",null,4,"17.12.0024","A"]
[5,170301,"EDI IMAM MUTAQIN","TI","LAKI-LAKI",5,null,"17.11.0116","A"]
[6,170290,"MU'AZIZ FAJARUDIN","TI","LAKI-LAKI",null,6,"17.12.0033","A"]
[7,170339,"DEVANDA RIZKI RAMADHAN","SI","LAKI-LAKI",7,null,"17.12.0028","A"]
[8,170321,"BAHAR NURRUS CHANDRA ALAMSYAH","SI","LAKI-LAKI",null,8,"17.11.0258","A"]
[9,170345,"MUHAMMAD RAHMAT HADIYAMIN","TI SORE","LAKI-LAKI",9,null,"17.11.0107","D"]
[10,170342,"TRI SEPTI WIDI YANTI","SI","PEREMPUAN",null,10,"17.12.0025","A"]
[11,170332,"FADILLAH ANSORI","TI","LAKI-LAKI",11,null,"17.11.0142","D"]
[12,170344,"JEFFRI IRAWAN","TI","LAKI-LAKI",null,12,"17.11.0288","A"]
[13,170322,"EVI SINDIYANTI","SI","PEREMPUAN",13,null,"17.12.0026","A"]
[14,170320,"ALFA RIZKI","TI","LAKI-LAKI",null,14,"17.11.0177","D"]
[15,170229,"UBAIDILLAH AHMAD","TI","LAKI-LAKI",15,null,"17.11.0221","A"]
[16,170253,"SUCI AMALIA","SI","PEREMPUAN",null,16,"17.11.0256","A"]
[17,170318,"DISTA TRIANISFI","SI","PEREMPUAN",17,null,"17.12.0152","B"]
[18,170252,"ARRYAN SETIAWAN","TI","LAKI-LAKI",null,18,"17.11.0065","A"]
[19,170255,"HASNA ENDAH SAPTAWATI","TI","PEREMPUAN",19,null,"17.11.0067","A"]
[20,170306,"CHOLIVIA INTAN NUR SAFITRI","SI","PEREMPUAN",null,20,"17.11.0187","A"]
[21,170221,"TITIN MEISAROH ","SI","PEREMPUAN",21,null,"17.12.0038","A"]
[22,170257,"YUDHISTIRA JANICE AL SAVA","TI","LAKI-LAKI",null,22,"17.11.0097","A"]
[23,170152,"FARA NOVI ANA","TI","PEREMPUAN",23,null,"17.11.0290","A"]
[24,170285,"RIZKIYANA CATUR PRADANA","TI","LAKI-LAKI",null,24,"17.11.0309","A"]
[25,170305,"ANANG SUDARMAYA","SI","LAKI-LAKI",25,null,"17.12.0058","A"]
[26,170241,"HENDI PRADANA","SI","LAKI-LAKI",null,26,"17.12.0034","A"]
[27,170215,"ASIF BAHRIA","SI","LAKI-LAKI",27,null,"17.12.0102","A"]
[28,170373,"WAHYU NUGROHO","TI","LAKI-LAKI",null,28,"17.12.0160","A"]
[29,{"$nulls":4},29,null,{"$error":"#N/A"}]
[30,{"$nulls":5},30,{"$error":"#N/A"}]
[31,{"$nulls":4},31,null,{"$error":"#N/A"}]
[32,{"$nulls":5},32,{"$error":"#N/A"}]
[33,{"$nulls":4},33,null,{"$error":"#N/A"}]
[34,{"$nulls":5},34,{"$error":"#N/A"}]
[]
["KELOMPOK PELATIHAN SUPER UNGGUL (PSU)"]
["KELOMPOK A.2 ( Ruang AULA )"]
["JUMAT, 07 Juli 2017"]
["13.00 - 17.00 WIB"]
[]
["NO.","NO.DAF","NAMA","PRODI","JENIS","PARAF"]
[{"$nulls":4},"KELAMIN"]
[1,170233,"ILHAM ALFAN HIDAYAT","TI","LAKI-LAKI",1,null,"17.11.0098","A"]
[2,170029,"CAROKO WASESO YEKTI","TI","LAKI-LAKI",null,2,"17.11.0104","D"]
[3,170127,"SIMON SOFIAN IWAN WIBOWO","TI","LAKI-LAKI",3,null,"17.11.0079","A"]
[4,170183,"NUR ROCHMAN ALFATONI","TI","LAKI-LAKI",null,4,"17.11.0068","D"]
[5,170208,"TEGAR AFIF ASHARI","TI(SORE)","LAKI-LAKI",5,null,"17.11.0336","A"]
[6,170227,"FATIN MUSTIKA SARI","SI","PEREMPUAN",null,6,"17.12.0089","A"]
[7,170228,"AKHDAN RAHMI HANIIF","TI SORE","LAKI-LAKI",7,null,"17.12.0169","A"]
[8,170234,"ILHAM AKBAR HABIBIE","TI","LAKI-LAKI",null,8,"17.11.0061","A"]
[9,170249,"I NYOMAN PUTHUT WIJAYA","SI","LAKI-LAKI",9,null,"17.12.0105","A"]
[10,170251,"DARMAWAN KUSUMA","TI","LAKI-LAKI",null,10,"17.11.0070","D"]
[11,170254,"BRILIAN ALFAIN NUSA BHAKTI","SI","LAKI-LAKI",11,null,"17.12.0029","B"]
[12,170256,"RIZQI GILANG RAMADHAN","TI","LAKI-LAKI",null,12,"17.11.0255","D"]
[13,170259,"RETNO DWI GUSTI HENDARWESTI","SI","PEREMPUAN",13,null,"17.12.0047","A"]
[14,170260,"YOGA AGUNG PRABOWO","TI","LAKI-LAKI",null,14,"17.12.0031","A"]
[15,170261,"SETIANINGSIH","TI","PEREMPUAN",15,null,"17.11.0064","A"]
[16,170265,"DINO PURNAMA AJI","TI","LAKI-LAKI",null,16,"17.11.0088","A"]
[17,170265,"GAGAH WINASIS","TI","LAKI-LAKI",17,null,"17.11.0088","A"]
[18,170269,"KEVIN ZEFANYA TIRTA IRAWAN","TI","LAKI-LAKI",null,18,"17.11.0080","D"]
[19,170270,"LUTFI NUR DIANTO","TI","LAKI-LAKI",19,null,"17.11.0154","A"]
[20,170278,"ABIDIN HIDAYANTO","TI","LAKI-LAKI",null,20,"17.12.0145","A"]
[21,170279,"RAFFI ANDIKA PRADANA","SI","LAKI-LAKI",21,null,"17.11.0083","A"]
[22,170280,"MA'RUF MAFTUKHIN ","SI","LAKI-LAKI",null,22,"17.12.0072","A"]
[23,170281,"ARIF NUGROHO AJI","TI","LAKI-LAKI",23,null,"17.12.0073","A"]
[24,170290,"WIDYA HANA SAFITRI","SI","PEREMPUAN",null,24,"17.12.0033","A"]
[25,170291,"MUFID ARZUDA","TI","LAKI-LAKI",25,null,"17.11.0094","A"]
[26,170295,"FAIZ ZURRAHMAN AS SIROZ","SI","LAKI-LAKI",null,26,"17.12.0108","B"]
[27,170297,"UMAM EGA PRATAMA","TI","LAKI-LAKI",27,null,"17.11.0071","D"]
[28,170297,"INSAN IKHLASUL AMAL","TI","LAKI-LAKI",null,28,"17.11.0071","A"]
[29,170298,"RENO DERMAWAN MUTIARA PUTRA","TI","LAKI-LAKI",29,null,"17.11.0110","A"]
[30,170299,"AMALIA WAHYU UTAMI","SI","PEREMPUAN",null,30,"17.11.0111","A"]
[31,170302,"ZIDA KUMALA SA'ADAH","TI","PEREMPUAN",31,null,"17.11.0090","A"]
[32,170305,"MAGHFIRA NURUL ISNAINI","SI","PEREMPUAN",null,32,"17.12.0058","A"]
[33,170311,"AMAR FARICKHIN","SI","LAKI-LAKI",33,null,{"$error":"#N/A"},"D"]
[34,170313,"SHAFIRA RIZKY","TI","PEREMPUAN",null,34,"17.11.0096","D"]
[35,170323,"DAVA YURISDIKA","TI","LAKI-LAKI",35,null,"17.12.0149","A"]
[36,170348,"CANDRA SANTIKA","TI","PEREMPUAN",null,36,"17.11.0082","A"]
[37,170353,"RAHMA SARI FAUZIYAH","SI","PEREMPUAN",37,null,"17.11.0340","A"]
[38,170354,"RAHMI SARI FAUZIYAH","SI","PEREMPUAN",null,38,"17.12.0130","A"]
[39,170369,"RICKY SUDIYANTO","TI","LAKI-LAKI",39,null,"17.11.0215","B"]
[]
["KELOMPOK PELATIHAN SUPER UNGGUL (PSU)"]
["KELOMPOK B.2 ( Ruang 2.1 )"]
["JUMAT, 07 Juli 2017"]
["13.00-17.00 Wib"]
[]
["NO.","NO.DAF","NAMA","PRODI","JENIS","PARAF"]
[{"$nulls":4},"KELAMIN"]
[1,170327,"IKBAL GALIH NURPAMUNGKAS","SI","LAKI-LAKI",1,null,"17.11.0343","A"]
[2,170273,"M.NAFI FANAULKIROM","SI","LAKI-LAKI",null,2,"17.12.0155","A"]
[3,170016,"RANGGA GUSTI ANANTA","TI(SORE)","LAKI-LAKI",3,null,"17.11.0007","A"]
[4,170326,"ARIEF MIFTAH NUR FAIZI","TI","LAKI-LAKI",null,4,"17.11.0226","A"]
[5,170351,"MUHAMAD HISYAM ZUHDI","TI","LAKI-LAKI",5,null,"17.11.0271","D"]
[6,170269,"KURNIA HANDARA","TI","LAKI-LAKI",null,6,"17.11.0080","D"]
[7,170337,"MENTARI RIZKI EGAYANTI","TI","PEREMPUAN",7,null,{"$error":"#N/A"},"D"]
[8,170336,"MAMAT SUPRIYANTO","TI SORE","LAKI-LAKI",null,8,"17.11.0081","A"]
[9,170348,"IMUNG DWI UPAYA","TI","PEREMPUAN",9,null,"17.11.0082","A"]
[10,170307,"RYAN IBNU RIZKYARDHANA","SI","LAKI-LAKI",null,10,"17.12.0063","A"]
[11,170351,"DHIMAS BANYU PERWITA","SI","LAKI-LAKI",11,null,"17.11.0271","A"]
[12,170313,"LUPITA INDAH FERISKA","TI","PEREMPUAN",null,12,"17.11.0096","D"]
[13,170331,"PUTRI DWI ERFIYANTI","TI","PEREMPUAN",13,null,"17.11.0092","A"]
[14,170331,"ACHMAD RUSLIYANSYAH SAFRONI","TI","LAKI-LAKI",null,14,"17.11.0092","B"]
[15,170328,"LUSY RAHMAWAN PANGESTU","TI","LAKI-LAKI",15,null,"17.12.0142","D"]
[16,170369,"DONI HIDAYAT","TI","LAKI-LAKI",null,16,"17.11.0215","A"]
[17,170333,"GIRI INDAH UMBARAWATI","SI","PEREMPUAN",17,null,"17.11.0095","A"]
[18,170370,"ULUNG BUDI HARTONO","SI","LAKI-LAKI",null,18,"17.11.0089","A"]
[19,170363,"MUHAMMAD RIFQI ARIYADI","TI","LAKI-LAKI",19,null,"17.11.0331","B"]
[20,170366,"SINGGIH SYAFRIZAL","TI","LAKI-LAKI",null,20,"17.12.0134","D"]
[21,170320,"AGUNG PUTRA PRATAMA","TI","LAKI-LAKI",21,null,"17.11.0177","A"]
[22,170373,"HABIBBULLOH ROSYID RIDHO","SI","LAKI-LAKI",null,22,"17.12.0160","A"]
[23,170367,"RINGO ADAM BINTANG ALDINO","TI","LAKI-LAKI",23,null,"17.11.0304","B"]
[24,170365,"SITI AMALIAH","SI","PEREMPUAN",null,24,"17.11.0333","C"]
[25,170374,"INDRA ALAN NUGROHO","TI","LAKI-LAKI",25,null,"17.11.0267","D"]
[26,170195,"WAWA MAISA FINANTO","TI","LAKI-LAKI",null,26,"17.12.0099","A"]
[27,170377,"ERIANA ZAHROTUL FIRDAUS","SI","PEREMPUAN",27,null,"17.12.0086","D"]
[28,170377,"MUHAMMAD FATIKHUL BIRRI","TI","LAKI-LAKI",null,28,"17.12.0086","D"]
[29,170385,"EKA SUCI NOPIE HANTARI","TI","PEREMPUAN",29,null,"17.11.0085","D"]
[30,170241,"DEVI NURAENI","SI","PEREMPUAN",null,30,"17.12.0034","A"]
[31,{"$nulls":4},31,null,{"$error":"#N/A"}]
[32,{"$nulls":5},32,{"$error":"#N/A"}]
[33,{"$nulls":4},33,null,{"$error":"#N/A"}]
[34,{"$nulls":5},34,{"$error":"#N/A"}]
[]
["KELOMPOK PELATIHAN SUPER UNGGUL (PSU)"]
["KELOMPOK A.1 ( Ruang AULA )"]
["RABU, 09 AGUSTUS 2017"]
["09.00 - 13.00 WIB"]
[]
["NO.","NO.DAF","NAMA","PRODI","JENIS","PARAF"]
[{"$nulls":4},"KELAMIN"]
[1,170172,"MUHAMMAD SAFRIJAL ZULMI","TI","LAKI-LAKI",1,null,"17.12.0037","A"]
[2,170374,"INDRA ALAN NUGROHO","TI","LAKI-LAKI",null,2,"17.11.0267","A"]
[3,170381,"HERAYA FITRA","SI","LAKI-LAKI",3,null,"17.11.0293","A"]
[4,170379,"GHIFARI IDHAM SATRIAN","T","LAKI-LAKI",null,4,"17.11.0321","A"]
[5,170258,"MUHAMMAD IKHSAN NURDIN","SI","LAKI-LAKI",5,null,"17.11.0158","B"]
[6,170380,"FAISHAL ANWAR FADHILLAH ","TI","LAKI-LAKI",null,6,"17.11.0259","A"]
[7,170397,"NUR AZIZ PRAMUDYA","TI","LAKI-LAKI",7,null,"17.11.0135","A"]
[8,170404,"SEPTA AGENG NUGROHO","SI","LAKI-LAKI",null,8,"17.12.0164","A"]
[9,170383,"ISTI ROHAYATUN","SI","PEREMPUAN",9,null,"17.11.0275","A"]
[10,170363,"ZIAD MIQDAD HAQQONI","TI","LAKI-LAKI",null,10,"17.11.0331","A"]
[11,170379,"RACHMADDANI","TI","LAKI-LAKI",11,null,"17.11.0321","A"]
[12,170273,"GHAUSHIL BADRI AMIN","TI","LAKI-LAKI",null,12,"17.12.0155","A"]
[13,170211,"CICI WULAN SARI","SI","PEREMPUAN",13,null,"17.12.0030","A"]
[14,170418,"RISKA INDAH NURANI","SI","PEREMPUAN",null,14,"17.11.0176","A"]
[15,170320,"ALFA RIZKI","TI","LAKI-LAKI",15,null,"17.11.0177","A"]
[16,170230,"REIYVAL WILIM PRATAMA","TI","LAKI-LAKI",null,16,"17.11.0270","B"]
[17,170173,"RINA ELMI SOFIANA","TI","PEREMPUAN",17,null,"17.11.0168","A"]
[18,170351,"MUHAMAD HISYAM ZUHDI","TI","LAKI-LAKI",null,18,"17.11.0271","A"]
[19,170332,"FADILLAH ANSORI","TI","LAKI-LAKI",19,null,"17.11.0142","A"]
[20,170103,"ZURNAEN EVAN ZIZA RIADHI","TI","LAKI-LAKI",null,20,"17.11.0055","A"]
[21,170104,"FAISAL ISKA UKHRIZA","TI","LAKI-LAKI",21,null,"17.11.0056","A"]
[22,170313,"SHAFIRA RIZKY","TI","PEREMPUAN",null,22,"17.11.0096","A"]
[23,170401,"RISQI BAYU PRATAMA","TI","LAKI-LAKI",23,null,"17.11.0157","A"]
[24,170405,"RISKI AHMAD YUSRON","TI","LAKI-LAKI",null,24,"17.12.0137","E"]
[25,170401,"DIYAN WASONO ADHI","SI","LAKI-LAKI",25,null,"17.11.0157","A"]
[26,170417,"TRIONO ANGGI NUGROHO","TI","LAKI-LAKI",null,26,"17.11.0102","A"]
[27,170528,"GILANG NUR ALFIAN","TI(SORE)","LAKI-LAKI",27,null,"17.11.0218","A"]
[28,170251,"DARMAWAN KUSUMA","TI","LAKI-LAKI",null,28,"17.11.0070","A"]
[29,170274,"RISKI RAHMATULOH","TI","LAKI-LAKI",29,null,"17.11.0091","A"]
[30,170297,"UMAM EGA PRATAMA","TI","LAKI-LAKI",null,30,"17.11.0071","A"]
[31,170256,"RIZQI GILANG RAMADHAN","TI","LAKI-LAKI",31,null,"17.11.0255","A"]
[32,170391,"IVAN ZAKA MUBAROK","SI","LAKI-LAKI",null,32,"17.11.0127","A"]
[33,170416,"ABDUL AZIZ","TI","LAKI-LAKI",33,null,"17.11.0137","A"]
[34,170285,"YUDITYA HARI NUGROHO","SI","LAKI-LAKI",null,34,"17.11.0309","A"]
[35,170029,"CAROKO WASESO Y","TI","LAKI-LAKI",35,null,"17.11.0104","A"]
[36,170042,"ESA DAMAYANTI","SI","PEREMPUAN",null,36,"17.12.0122","B"]
[37,{"$nulls":4},37,null,{"$error":"#N/A"}]
[]
[]
["KELOMPOK PELATIHAN SUPER UNGGUL (PSU)"]
["KELOMPOK B.1 ( Ruang 2.1 )"]
["RABU, 09 AGUSTUS 2017"]
["09.00 - 13.00 WIB"]
[]
["NO.","NO.DAF","NAMA","PRODI","JENIS","PARAF"]
[{"$nulls":4},"KELAMIN"]
[1,170398,"ALFAN RIZKI LUTFIANTO","TI","LAKI-LAKI",1,null,"17.11.0291","A"]
[2,170431,"BAYU SETIAJI","TI","LAKI-LAKI",null,2,"17.11.0169","A"]
[3,170424,"RAFI RAMADHAN","TI","LAKI-LAKI",3,null,"17.11.0224","A"]
[4,170236,"RIZKY BAKHTIAR","TI","LAKI-LAKI",null,4,"17.11.0119","A"]
[5,170462,"FAHMI SAPTIAN LUBIS","TI","LAKI-LAKI",5,null,"17.11.0285","A"]
[6,170392,"DANI FAISAL","TI","LAKI-LAKI",null,6,"17.12.0117","A"]
[7,170397,"SHANDI DESTIAWAN","TI","LAKI-LAKI",7,null,"17.11.0135","A"]
[8,170440,"REYHAN YUDHISTIRA JUNIAN","SI","LAKI-LAKI",null,8,"17.11.0232","A"]
[9,170428,"THESSA AYU PRATOYO","SI","PEREMPUAN",9,null,"17.12.0041","A"]
[10,170071,"PUTU LEO KHARISMA BANGSA","TRANSFER","LAKI-LAKI",null,10,"17.11.0027","A"]
[11,170449,"HARUN SUFAHMI","SI","LAKI-LAKI",11,null,"17.11.0156","A"]
[12,170410,"KETY NOVIANTI","SI","PEREMPUAN",null,12,"17.12.0118","A"]
[13,170453,"JERI IHSAN HIDAYATULLOH","TI","LAKI-LAKI",13,null,"17.12.0114","A"]
[14,170435,"NUHGROHO BAHARUDIN PUTRA","TI","LAKI-LAKI",null,14,"17.11.0108","A"]
[15,170282,"AYU DISTARIYANI SAPUTRI","SI","PEREMPUAN",15,null,"17.11.0069","A"]
[16,170511,"FERDYNAN ARI RAHMADAN","TI SORE","LAKI-LAKI",null,16,"17.11.0153","A"]
[17,170424,"AGUNG SAPUTRA ","TI","LAKI-LAKI",17,null,"17.11.0224","A"]
[18,170428,"GALIH ALAN MADHANI","TI","LAKI-LAKI",null,18,"17.12.0041","A"]
[19,170430,"RAHMAT HIDAYAT FITRIANTO","TI","LAKI-LAKI",19,null,"17.11.0264","A"]
[20,170208,"TEGAR AFIF ASHARI","SI","LAKI-LAKI",null,20,"17.11.0336","E"]
[21,170495,"ANGGI RIZKA UTAMI","SI","PEREMPUAN",21,null,"17.12.0138","A"]
[22,170489,"DEMA ABUBAKAR","TI","LAKI-LAKI",null,22,"17.11.0281","A"]
[23,170446,"M ZIDAN NAJMUL FATAH","TI","LAKI-LAKI",23,null,"17.11.0222","A"]
[24,170483,"ABI DWI RAFDI","TI","LAKI-LAKI",null,24,"17.11.0133","A"]
[25,170468,"DITA AYUNINGTIAS","TI","PEREMPUAN",25,null,"17.11.0121","A"]
[26,170436,"IVAN SETYA AZMI","TI","LAKI-LAKI",null,26,"17.11.0146","A"]
[27,170434,"FARHAN BANI RIZKI ","TI","LAKI-LAKI",27,null,"17.11.0109","A"]
[28,170457,"NUR HANIFAH ","TI","PEREMPUAN",null,28,"17.12.0053","A"]
[29,170478,"YOGA DWI PRASETYO","TI","LAKI-LAKI",29,null,"17.11.0283","B"]
[30,170181,"DIDIK WICAKSONO","TI ","LAKI-LAKI",null,30,"17.12.0039","A"]
[31,170438,"ROY KRISNA PRATAMA","SI","LAKI-LAKI",31,null,"17.12.0074","A"]
[32,170449,"KENDY KUKILA","TI","LAKI-LAKI",null,32,"17.11.0156","B"]
[]
["KELOMPOK PELATIHAN SUPER UNGGUL (PSU)"]
["KELOMPOK A.2 ( Ruang AULA )"]
["RABU, 09 AGUSTUS 2017"]
["13.00 - 17.00 WIB"]
[]
["NO.","NO.DAF","NAMA","PRODI","JENIS","PARAF"]
[{"$nulls":4},"KELAMIN"]
[1,170456,"HANIN SEDI SEPTIAN","TI","LAKI-LAKI",1,null,"17.11.0150","B"]
[2,170498,"NUGROHO CHANDRA BUWONO","SI","LAKI-LAKI",null,2,"17.11.0280","A"]
[3,170499,"MUHAMAD FAQIH RIDHO","SI","LAKI-LAKI",3,null,"17.12.0046","A"]
[4,170484,"EGI CAHYA GUSTI YANA","TI","LAKI-LAKI",null,4,"17.11.0112","A"]
[5,170402,"NOVIANTO SIDIK PRADANA","TI","LAKI-LAKI",5,null,"17.11.0276","A"]
[6,170512,"DANANG RIKIYANTO","TI","LAKI-LAKI",null,6,"17.11.0128","A"]
[7,170408,"INDO CRIS MAXI DEMORE YAN RAMADHANI","TI","LAKI-LAKI",7,null,"17.11.0205","A"]
[8,170466,"FERDINAND NYOMAN DHANDI SETYAWAN","TI","LAKI-LAKI",null,8,"17.12.0112","A"]
[9,170437,"ROY KRISNA PRATAMA","SI","LAKI-LAKI",9,null,"17.11.0201","E"]
[10,170481,"CHANIF FAUZI","TI","LAKI-LAKI",null,10,"17.11.0152","A"]
[11,170470,"CYNTHIA SILVIANA WIJAYANTI","TI","PEREMPUAN",11,null,"17.12.0096","A"]
[12,170481,"IRHAM MOHAMAD FADLI","TI","LAKI-LAKI",null,12,"17.11.0152","B"]
[13,170409,"AMELIA PUTRIYANI","SI","PEREMPUAN",13,null,"17.11.0178","B"]
[14,170463,"RIZKA NUR ROFI'AH","SI","PEREMPUAN",null,14,"17.11.0115","A"]
[15,170157,"MUHAMMAD RIFAI","TI","LAKI-LAKI",15,null,"17.11.0238","A"]
[16,170491,"AL HAFIDZ HANIFAN ISLAHI","TI","LAKI-LAKI",null,16,"17.11.0219","A"]
[17,170492,"MUHAMMAD ILHAM HANAFI","TI","LAKI-LAKI",17,null,"17.11.0175","A"]
[18,170488,"MUHAMMAD RIFKI UBAEDILLAH","TI","LAKI-LAKI",null,18,"17.12.0131","A"]
[19,170501,"TEGUH BUDI SANTOSO","TI","LAKI-LAKI",19,null,"17.11.0282","E"]
[20,170500,"JULIO BHAGASKARA ADIPRADANA","TI","LAKI-LAKI",null,20,"17.12.0106","A"]
[21,170477,"SUSI SULISTYANINGSIH","TI","PEREMPUAN",21,null,"17.11.0217","A"]
[22,170477,"NABILLA AYUNING SAFIRA","SI","PEREMPUAN",null,22,"17.11.0217","A"]
[23,170471,"ADAM AGENG WIJAYA","SI","LAKI-LAKI",23,null,"17.11.0174","A"]
[24,170467,"ENGGAR PRI PAMBUDI","TI","LAKI-LAKI",null,24,"17.11.0166","A"]
[25,170529,"ISMU IRAWAN","TI","LAKI-LAKI",25,null,"17.11.0179","A"]
[26,170485,"RULI ANDRESTA","TI","LAKI-LAKI",null,26,"17.11.0214","A"]
[27,170460,"ANISA NUR FAIZAH","SI","PEREMPUAN",27,null,"17.11.0163","A"]
[28,170460,"GUNTUR EKA PRASETYO","TI","LAKI-LAKI",null,28,"17.11.0163","A"]
[29,170465,"SYAFAAT","TI","LAKI-LAKI",29,null,"17.11.0262","A"]
[30,170465,"MALDI SAVARA HIDAYAT","SI","LAKI-LAKI",null,30,"17.11.0262","A"]
[31,170452,"NAAN DAYUNA","SI","LAKI-LAKI",31,null,"17.12.0061","A"]
[32,170450,"IRFAN FATKHURROHMAN","SI","LAKI-LAKI",null,32,"17.12.0045","B"]
[33,170530,"YULIAN AJRI ARDIANSYAH","TI","LAKI-LAKI",33,null,"17.11.0120","A"]
[34,170461,"FAUZI TRI HIDAYAT","TI","LAKI-LAKI",null,34,"17.12.0082","A"]
[35,170446,"LINTANG AYU LAILATUL JANNAH","TI","PEREMPUAN",35,null,"17.11.0222","A"]
[36,170412,"RUDI ADITYA","TI","LAKI-LAKI",null,36,"17.12.0042","A"]
[37,170269,"KEVIN ZEFANYA TIRTA IRAWAN","SI","LAKI-LAKI",null,null,"17.11.0080","A"]
[]
[]
["KELOMPOK PELATIHAN SUPER UNGGUL (PSU)"]
["KELOMPOK B.2 ( Ruang 2.1 )"]
["RABU, 09 AGUSTUS 2017"]
["13.00 - 17.00 WIB"]
[]
["NO.","NO.DAF","NAMA","PRODI","JENIS","PARAF"]
[{"$nulls":4},"KELAMIN"]
[1,170389,"ALFIAN WIDY REKSA","TI","LAKI-LAKI",1,null,"17.12.0150","A"]
[2,170544,"FAIZAL AMIN","SI","LAKI-LAKI",null,2,"17.11.0203","A"]
[3,170522,"LENI SETIANI","SI","PEREMPUAN",3,null,"17.12.0056","A"]
[4,170522,"INDIKA MANGGALA PUTRA","SI","LAKI-LAKI",null,4,"17.12.0056","C"]
[5,170525,"MOHAMAD AIFAN DWI WIYATAMA ANDRIAN","SI","LAKI-LAKI",5,null,"17.12.0148","A"]
[6,170550,"ABU RIZAL RAFSANJANI","TI","LAKI-LAKI",null,6,"17.11.0294","A"]
[7,170487,"RUDI AGUS PRAPTOMO","SI","LAKI-LAKI",7,null,"17.11.0124","A"]
[8,170420,"MAULUDIA PANJI YULIANSAH","TI","LAKI-LAKI",null,8,"17.12.0173","A"]
[9,170496,"HELMI FAKHRUDDIN","TI","LAKI-LAKI",9,null,"17.12.0104","A"]
[10,170495,"WAHYU ANANG SUBEKTI","SI","LAKI-LAKI",null,10,"17.12.0138","A"]
[11,170497,"MOCHAMMAD RIZAL ASSIDIQ","TI","LAKI-LAKI",11,null,"17.11.0195","A"]
[12,170090,"ANKGRAENI KUSUMA DEWI","SI","PEREMPUAN",null,12,"17.12.0110","A"]
[13,170403,"EDI RIANTO","SI","LAKI-LAKI",13,null,"17.11.0118","A"]
[14,170408,"ABI YOGA TAMPOMO","TI","LAKI-LAKI",null,14,"17.11.0205","A"]
[15,170386,"DIKA NOER MUHAMAD FATAH","SI","LAKI-LAKI",15,null,"17.11.0145","A"]
[16,170419,"WILUJENG PURNOMO ANGKADI","TI","LAKI-LAKI",null,16,"17.12.0081","C"]
[17,170449,"KENDY KUKILA","TI","LAKI-LAKI",17,null,"17.11.0156","E"]
[18,170382,"LUTFI YUDA RAMADHAN","TI","LAKI-LAKI",null,18,"17.12.0100","A"]
[19,170390,"ANGGA FERDIYANTO","TI","LAKI-LAKI",19,null,"17.11.0236","A"]
[20,170375,"MOHAMAD FAIQ NURROHMAN","TI","LAKI-LAKI",null,20,"17.11.0181","A"]
[21,170387,"M SULKHAN TAMA RAMDHANI","SI","LAKI-LAKI",21,null,"17.12.0094","A"]
[22,170433,"LU'AI NUR FIRDAUS","TI","LAKI-LAKI",null,22,"17.11.0106","A"]
[23,170432,"MUHAMAD ABDUL MUFIDZ","TI","LAKI-LAKI",23,null,"17.11.0103","A"]
[24,170411,"SEKAR ANDINI","SI","PEREMPUAN",null,24,"17.12.0044","A"]
[25,170441,"TATA SALANJAR GUSTINADI","SI","LAKI-LAKI",25,null,"17.12.0040","A"]
[26,170505,"REFIS AULAWY NOOR","TI","LAKI-LAKI",null,26,"17.11.0289","A"]
[27,170416,"MULKI ALI MUBAROK","TI SORE","LAKI-LAKI",27,null,"17.11.0137","A"]
[28,170385,"EKA SUCI NOPIE HANTARI","TI","PEREMPUAN",null,28,"17.11.0085","A"]
[29,170511,"ADIL AMRULLAH","TI","LAKI-LAKI",29,null,"17.11.0153","E"]
[{"$nulls":6},30,{"$error":"#N/A"}]
[{"$nulls":7},{"$error":"#N/A"}]
[{"$nulls":7},{"$error":"#N/A"}]
[]
["KELOMPOK PELATIHAN SUPER UNGGUL (PSU)"]
["KELOMPOK A ( Ruang AULA )"]
["SABTU, 23 SEPTEMBER 2017"]
["08.00 - 14.00 WIB"]
[]
["NO.","NO.DAF","NAMA","PRODI","JENIS","PARAF"]
[{"$nulls":4},"KELAMIN"]
[1,170536,"MOH FADLIL FAQIH","TI","LAKI-LAKI",1,null,"17.12.0120","A"]
[2,170534,"REGGY BOWO LEKSANA","SI","LAKI-LAKI",null,2,"17.11.0342","A"]
[3,170541,"ABDUL GOFUR","SI","LAKI-LAKI",3,null,"17.12.0091","A"]
[4,170231,"RAEZA YUTHA TRIYUNDI","TI","LAKI-LAKI",null,4,"17.11.0054","A"]
[5,170516,"IRAWAN BAROKAH","TI","LAKI-LAKI",5,null,"17.12.0143","A"]
[6,170388,"UGA SYAHRIL RAMADHAN","SI","LAKI-LAKI",null,6,"17.11.0206","A"]
[7,170374,"INDRA ALAN NUGROHO","TI","LAKI-LAKI",7,null,"17.11.0267","A"]
[8,170535,"ERADIKA REZA LUTFIANSYAH","SI","LAKI-LAKI",null,8,"17.12.0079","A"]
[9,170546,"WAHYU PRASETYO","TI","LAKI-LAKI",9,null,"17.11.0241","A"]
[10,170517,"HASTIWI AMELIA NURAWALIAH","SI","PEREMPUAN",null,10,"17.11.0198","A"]
[11,170513,"ERICK SETIO PAMUJI","TI","LAKI-LAKI",11,null,"17.11.0171","A"]
[12,170540,"KELLY DHINA ARYANITA","SI","PEREMPUAN",null,12,"17.11.0330","A"]
[13,170528,"GALIH BAGASKORO","TI","LAKI-LAKI",13,null,"17.11.0218","A"]
[14,170543,"GALIH AHMAD ZAKIA RAMADHAN","TI","LAKI-LAKI",null,14,"17.12.0151","A"]
[15,170456,"FAISAL FAUZI","SI","LAKI-LAKI",15,null,"17.11.0150","A"]
[16,170538,"RESTU LALIN PUTRA SATRIA","TI","LAKI-LAKI",null,16,"17.11.0184","A"]
[17,170523,"ADIMAS SYAFI'I","TI","LAKI-LAKI",17,null,"17.12.0140","A"]
[18,170557,"NUR ACHMAD MUKTI AZIZ","TI","LAKI-LAKI",null,18,"17.11.0192","A"]
[19,170562,"RYAN ARYANDI","SI","LAKI-LAKI",19,null,"17.12.0163","A"]
[20,170195,"MUHAMMAD ASEP ROSYADI","TI","LAKI-LAKI",null,20,"17.12.0099","A"]
[21,170578,"AFIF ANDI NUR AGAZI","TI","LAKI-LAKI",21,null,"17.11.0144","A"]
[22,170482,"FAHMI REZA SAHPUTRA","TI","LAKI-LAKI",null,22,"17.11.0141","A"]
[23,170384,"IRFAN RIFAI AZIZ","TI","LAKI-LAKI",23,null,"17.12.0071","A"]
[24,170490,"WAHYU WIDIANTO","TI","LAKI-LAKI",null,24,"17.11.0223","A"]
[25,170537,"PANJI IRAWAN","TI","LAKI-LAKI",25,null,"17.11.0189","A"]
[26,170586,"TANJUNG ISNANTIA KENJI","SI","PEREMPUAN",null,26,"17.12.0158","A"]
[27,170568,"JUNIAR IMANDANNI WIDODO","TI","LAKI-LAKI",27,null,"17.11.0207","A"]
[28,170549,"BRAM PRADANA MARDA","TI","LAKI-LAKI",null,28,"17.12.0062","A"]
[29,170556,"FAISAL LUTFI HAKIM","TI","LAKI-LAKI",29,null,"17.11.0278","A"]
[30,170554,"WAHYU RAMDANI","TI","LAKI-LAKI",null,30,"17.11.0339","A"]
[31,170473,"FARINDA EKA PUTRI","SI","PEREMPUAN",31,null,"17.12.0088","A"]
[32,170555,"RAHMAWAN AFIANTO SAPUTRO","TI","LAKI-LAKI",null,32,"17.11.0301","A"]
[33,170575,"DIMAS GONDO UTOMO","SI","LAKI-LAKI",33,null,"17.12.0107","A"]
[34,170212,"IHWAN PRASETIO","TI","LAKI-LAKI",null,34,"17.12.0021","A"]
[35,170625,"HASANANTO ZAKARIA","TI","LAKI-LAKI",35,null,"17.11.0208","A"]
[36,170621,"MUHAMAD ALIF ALFARIZKI","SI","LAKI-LAKI",null,36,"17.12.0070","A"]
[37,170416,"MULKI ALI MUBAROK","TI SORE","LAKI-LAKI",37,null,"17.11.0137","A"]
[38,170634,"RAHARDIAN ARIF PRATAMA","TI SORE","LAKI-LAKI",null,38,"17.11.0170","A"]
[39,170636,"AFIFAH ANANDA PUTRI","TI","PEREMPUAN",39,null,"17.11.0292","A"]
[40,170642,"ABI FIRMANSYAH","TI","LAKI-LAKI",null,40,"17.11.0307","A"]
[41,170269,"KURNIA HANDARA","TI","PEREMPUAN",41,null,"17.11.0080","A"]
[42,170518,"NAILIS SYAFI'AH","TI","PEREMPUAN",null,42,"17.12.0078","A"]
[43,170511,"ADIL AMRULLAH","TI","LAKI-LAKI",43,null,"17.11.0153","A"]
[44,170522,"INDIKA MANGGALA PUTRA","SI","LAKI-LAKI",null,44,"17.12.0056","A"]
[45,170425,"RAKHMAT AGNG YUDHANTO","TI","LAKI-LAKI",45,null,"17.11.0101","A"]
[46,170278,"YULISTIANA DEWI","SI","PEREMPUAN",null,46,"17.12.0145","A"]
[47,170651,"WIRA SAKTI AKBAR RIYADI","TI","LAKI-LAKI",47,null,"17.11.0312","A"]
[48,170631,"IMAM KHADAFI","TI","LAKI-LAKI",null,48,"17.12.0144","A"]
[49,170653,"MUH DANI MUNIF FARIN","TI","LAKI-LAKI",49,null,"17.11.0335","A"]
[50,170654,"HERI RAMADHAN","TI","LAKI-LAKI",null,50,"17.11.0228","A"]
[51,170650,"ZURAIDA YUNIAR FIRDAUS","SI","PEREMPUAN",51,null,"17.12.0141","A"]
[52,170618,"SENDI SETIAWAN",null,"LAKI-LAKI",null,52,"17.11.0172","A"]
[53,170146,"MUHAMMAD ANDY HIDAYAT","TI","LAKI-LAKI",53,null,"17.11.0200","A"]
[54,170019,"GILANG RIZKY MUSTOFA","TI","LAKI-LAKI",null,54,"17.11.0191","A"]
[55,170525,"ALVIAN MAJID","SI","LAKI-LAKI",55,null,"17.12.0148","A"]
[56,170344,"KANASTA FIRDAUS","TI","LAKI-LAKI",null,56,"17.11.0288","A"]
[]
[]
[]
["KELOMPOK PELATIHAN SUPER UNGGUL (PSU)"]
["KELOMPOK C ( Ruang 2.3 )"]
["SABTU, 23 SEPTEMBER 2017"]
["08.00 - 14.00 WIB"]
[]
["NO.","NO.DAF","NAMA","PRODI","JENIS","PARAF"]
[{"$nulls":4},"KELAMIN"]
[1,170373,"HABIBBULLOH ROSYID RIDHO","SI","LAKI-LAKI",1,null,"17.12.0160","A"]
[2,170559,"FARIZ KHABIB IBROHIM","SI","LAKI-LAKI",null,2,"17.12.0087","A"]
[3,170578,"HENDRI KUAT FEBRIANSYAH","TI","LAKI-LAKI",3,null,"17.11.0144","A"]
[4,170380,"FAISHAL ANWAR FADHILLAH ","SI","LAKI-LAKI",null,4,"17.11.0259","A"]
[5,170516,"DEA ROMI ANGGRAENI","SI","PEREMPUAN",5,null,"17.12.0143","A"]
[6,170502,"MUFLIH DZULFIAN","TI","LAKI-LAKI",null,6,"17.11.0161","A"]
[7,170326,"FANDI YULIANTO","TI","LAKI-LAKI",7,null,"17.11.0226","A"]
[8,170569,"MOHAMAD FAISAL","SI","LAKI-LAKI",null,8,"17.11.0310","A"]
[9,170566,"RIZAL SYUKRON NUGROHO","TI","LAKI-LAKI",9,null,"17.12.0095","A"]
[10,170451,"TEGAR DWI RAMADHAN","SI","LAKI-LAKI",null,10,"17.12.0055","A"]
[11,170560,"BINTARI HIDAYANTI","SI","PEREMPUAN",11,null,"17.12.0051","A"]
[12,170444,"JIMMY HANDRIANSYAH","TI","LAKI-LAKI",null,12,"17.11.0105","A"]
[13,170366,"SINGGIH SYAFRIZAL","TI","LAKI-LAKI",13,null,"17.12.0134","A"]
[14,170472,"VITA LISTIA ANDANI","SI","PEREMPUAN",null,14,"17.12.0057","A"]
[15,170440,"WINDIANINGSIH","TI","PEREMPUAN",15,null,"17.11.0232","A"]
[16,170189,"ANISA UMMUL LATIFAH","SI","PEREMPUAN",null,16,"17.11.0159","A"]
[17,170558,"SEPTIAN ILHAM SANTOSA","SI","LAKI-LAKI",17,null,"17.11.0132","A"]
[18,170345,"MUHAMMAD RAHMAT HADIYAMIN","TI SORE","LAKI-LAKI",null,18,"17.11.0107","A"]
[19,170328,"LUSY RAHMAWAN PANGESTU","TI","LAKI-LAKI",19,null,"17.12.0142","A"]
[20,170594,"WILLY RUBY OKTAVIANUS","TI","LAKI-LAKI",null,20,"17.12.0064","A"]
[21,170561,"MUJIBUROKHMAN","SI","LAKI-LAKI",21,null,"17.11.0269","A"]
[22,170545,"TEGAR PAMBUDI","TI","LAKI-LAKI",null,22,"17.12.0066","A"]
[23,170506,"NAUFAL MAULANA ANBIYA ","SI","LAKI-LAKI",23,null,"17.11.0125","A"]
[24,170627,"ABI NANDITA ARGA APRIA KUSUMA","TI","LAKI-LAKI",null,24,"17.12.0119","A"]
[25,170622,"ABDURRAHMAN AL GHOFIQI","TI","LAKI-LAKI",25,null,"17.12.0133","A"]
[26,170630,"MUSLIM ADILAH","SI","LAKI-LAKI",null,26,"17.12.0166","A"]
[27,170608,"ELFARIANI MIFTAKHUL JANAH","SI","PEREMPUAN",27,null,"17.12.0116","A"]
[28,170626,"ASRIL FAUZI NURHAKIM","SI","LAKI-LAKI",null,28,"17.11.0327","A"]
[29,170121,"ANGGRI PANJI ERMAYA","TI","LAKI-LAKI",29,null,"17.11.0323","A"]
[30,170553,"ANIQ VAUQON NAJIH","TI","LAKI-LAKI",null,30,"17.12.0060","A"]
[31,170539,"NELLY REGINA SUSANTI","TI SORE","PEREMPUAN",31,null,"17.11.0129","A"]
[32,170620,"DWI MEILIANA","SI","PEREMPUAN",null,32,"17.12.0098","A"]
[33,170630,"MOHAMMAD RAYHAN ALMADANI","SI","LAKI-LAKI",33,null,"17.12.0166","A"]
[34,170642,"MARWAN SETIANGGORO","SI","LAKI-LAKI",null,34,"17.11.0307","A"]
[35,170625,"PAMUNGKAS CATUR NUGROHO","TI","LAKI-LAKI",35,null,"17.11.0208","A"]
[36,170643,"INDAH GHINA SHAFIRA WARDHANI","SI","PEREMPUAN",null,36,"17.12.0167","A"]
[37,"16.11.0288","YOUNGKY RICKY AREIF WIBOWO","TI","LAKI-LAKI",37,null,"16.11.0288","A"]
[38,170549,"LISMA NUR SEPTIANA","SI","PEREMPUAN",null,38,"17.12.0062","A"]
[39,170639,"MUHAMMAD MARSHAL ABDALLAH","TI","LAKI-LAKI",39,null,"17.11.0211","A"]
[40,170648,"AULIA ULINNUHA AL FACHORY","TI","LAKI-LAKI",null,40,"17.11.0320","A"]
[]
["KELOMPOK PELATIHAN SUPER UNGGUL (PSU)"]
["KELOMPOK B ( Ruang 2.1 )"]
["SABTU, 23 SEPTEMBER 2017"]
["08.00 - 14.00 WIB"]
[]
["NO.","NO.DAF","NAMA","PRODI","JENIS","PARAF"]
[{"$nulls":4},"KELAMIN"]
[1,170583,"DINA FAJAR SULISTIYANI","TI","PEREMPUAN",1,null,"17.12.0052","A"]
[2,170582,"ZEZYA RAMADHANY KHARISMA MURTI","SI","PEREMPUAN",null,2,"17.11.0266","A"]
[3,170553,"MENIK PURWATI","SI","PEREMPUAN",3,null,"17.12.0060","A"]
[4,170615,"DIKKA SANY ARGIA","SI","LAKI-LAKI",null,4,"17.12.0132","A"]
[5,170429,"MANUT SUTRISNO","TI SORE","LAKI-LAKI",5,null,"17.11.0322","A"]
[6,170565,"HANDIKA AJI SAPUTRA","SI","LAKI-LAKI",null,6,"17.12.0115","A"]
[7,170599,"SATYA FARIZ NUR ANANTO","TI","LAKI-LAKI",7,null,"17.11.0306","A"]
[8,170586,"NADILLA PUTRI UTAMI","SI","PEREMPUAN",null,8,"17.12.0158","A"]
[9,170573,"TIKA SOFIANA","TI","PEREMPUAN",9,null,"17.11.0302","A"]
[10,170565,"SISKA PUTRI UTAMI","SI","PEREMPUAN",null,10,"17.12.0115","A"]
[11,170542,"NAELLA FAUZIATUL ABSONI","SI","PEREMPUAN",11,null,"17.12.0090","A"]
[12,170581,"BUDI KURNIAWAN","SI","LAKI-LAKI",null,12,"17.12.0121","A"]
[13,170600,"AZIZ REZA DWITAMA","SI","LAKI-LAKI",13,null,"17.12.0069","A"]
[14,170589,"RIZQI AGUNG SETIA WIBOWO","TI","LAKI-LAKI",null,14,"17.11.0160","A"]
[15,170601,"FIKRI ADI SUSENO","TI","LAKI-LAKI",15,null,"17.11.0212","A"]
[16,170602,"DEADRA IVANKA NAILUFAR","SI","PEREMPUAN",null,16,"17.11.0303","A"]
[17,170501,"TEGUH BUDI SANTOSO","TI","LAKI-LAKI",17,null,"17.11.0282","A"]
[18,170615,"IDA LAENI","SI","PEREMPUAN",null,18,"17.12.0132","A"]
[19,170594,"VERA CIDI MONARIKE","SI","PEREMPUAN",19,null,"17.12.0064","A"]
[20,170567,"HANENDYO ANDHI GURITA","TI","LAKI-LAKI",null,20,"17.11.0220","A"]
[21,170603,"RIZKY YOGA PANGESTU","TI","LAKI-LAKI",21,null,"17.12.0092","A"]
[22,170612,"AJI PANGESTU","SI","LAKI-LAKI",null,22,"17.11.0210","A"]
[23,170620,"SYAFIQ FEBRI PANGESTUNING TYAS","SI","LAKI-LAKI",23,null,"17.12.0098","A"]
[24,170599,"CARELL YUDHI HERNANI","SI","LAKI-LAKI",null,24,"17.11.0306","A"]
[25,170604,"NICO CESAR ARYANTO PRIMADANA","TI","LAKI-LAKI",25,null,"17.11.0204","A"]
[26,170581,"DEWI PUPUT SAPUTRI","TI","PEREMPUAN",null,26,"17.12.0121","A"]
[27,170352,"RIYANA INDAH CAHYANI","TI","PEREMPUAN",27,null,"17.12.0136","A"]
[28,170592,"KHAUTAL ADANI","TI","LAKI-LAKI",null,28,"17.11.0235","A"]
[29,170612,"RAMADHAN ARIF NURBASKORO","TI","LAKI-LAKI",29,null,"17.11.0210","A"]
[30,170469,"DEPPI PUSPITASARI","SI","PEREMPUAN",null,30,"17.11.0173","A"]
[31,170589,"NAUVAL  FAHMI ESA SULISTIANA","SI","LAKI-LAKI",31,null,"17.11.0160","A"]
[32,170616,"NUR AULIA RAHMAWATI","TI","PEREMPUAN",null,32,"17.12.0147","A"]
[33,170486,"FAIZAL RAMADHAN SUYITNO P","TI","LAKI-LAKI",33,null,"17.11.0284","A"]
[34,170505,"BAGAS SURYATAMA","TI","LAKI-LAKI",null,34,"17.11.0289","A"]
[35,170033,"MUHAMMAD RIZA FAUZILLAH","TI","LAKI-LAKI",35,null,"17.11.0126","A"]
[36,170085,"FIKRI RAMADHAN","TI","LAKI-LAKI",null,36,"17.11.0263","A"]
[37,170644,"MOHAMMAD SYIFA RAMADHAN","TI","LAKI-LAKI",37,null,"17.12.0135","A"]
[38,170146,"MUHAMMAD ANDY HIDAYAT","TI","LAKI-LAKI",null,38,"17.11.0200","A"]
[39,170648,"BAYU SETIA AJI","TI","LAKI-LAKI",39,null,"17.11.0320","A"]
[40,170650,"AKHMAD ANDRIAN SYAH","TI","LAKI-LAKI",null,40,"17.12.0141","A"]

{"sheet":"rekap","index":3,"n_rows":528,"n_cols":7,"rows_kept":528,"hidden":true}
["NO.","NO.DAF","NAMA","nama","x","nil","ket"]
[1,170014,"ABDUL GHOFUR",{"$f":"VLOOKUP(E2,Sheet1!$C$2:$D$495,2,0)","v":"ABDUL GHOFUR"},"17.11.0047","A",{"$f":"IF(C2=D2,\"Sama\",\"Tidak\")","v":"Sama"}]
[2,170038,"ACHMAD DIAN RAFI'I",{"$f":"VLOOKUP(E3,Sheet1!$C$2:$D$495,2,0)","v":"ACHMAD DIAN RAFI'I"},"17.11.0049","B","Sama"]
[3,170003,"ADIT TRI SEPTIAWAN",{"$f":"VLOOKUP(E4,Sheet1!$C$2:$D$495,2,0)","v":"ADIT TRI SEPTIAWAN"},"17.11.0243","B","Sama"]
[4,170052,"AFFAN AZ ZARQONI",{"$f":"VLOOKUP(E5,Sheet1!$C$2:$D$495,2,0)","v":"AFFAN AZ ZARQONI"},"17.11.0032","C","Sama"]
[5,170050,"AFREL PUTRA MAHENDRA",{"$f":"VLOOKUP(E6,Sheet1!$C$2:$D$495,2,0)","v":"AFREL PUTRA MAHENDRA"},"17.11.0042","A","Sama"]
[6,170031,"ANINDYA ANGGELINA",{"$f":"VLOOKUP(E7,Sheet1!$C$2:$D$495,2,0)","v":"ANINDYA ANGGELINA"},"17.12.0012","A","Sama"]
[7,170018,"ARI NUR RIZKI",{"$f":"VLOOKUP(E8,Sheet1!$C$2:$D$495,2,0)","v":"ARI NUR RIZKI"},"17.11.0048","A","Sama"]
[8,170047,"BAGAS WARDANA",{"$f":"VLOOKUP(E9,Sheet1!$C$2:$D$495,2,0)","v":"BAGAS WARDANA"},"17.12.0002","B","Sama"]
[9,170008,"BIMA RASENDRIYA INDRASTOTO",{"$f":"VLOOKUP(E10,Sheet1!$C$2:$D$495,2,0)","v":"BIMA RASENDRIYA INDRASTOTO"},"17.11.0006","A","Sama"]
[10,170009,"CANDRA NOVIAN",{"$f":"VLOOKUP(E11,Sheet1!$C$2:$D$495,2,0)","v":"CANDRA NOVIAN"},"17.12.0005","A","Sama"]
[12,170002,"DAFFA RIZQI ANDRIAN",{"$f":"VLOOKUP(E12,Sheet1!$C$2:$D$495,2,0)","v":"DAFFA RIZQI ANDRIAN"},"17.11.0028","A","Sama"]
[13,170040,"DEBI INDARTO",{"$f":"VLOOKUP(E13,Sheet1!$C$2:$D$495,2,0)","v":"DEBI INDARTO"},"17.11.0015","A","Sama"]
[14,170025,"DIMAS AJI PRASETYO",{"$f":"VLOOKUP(E14,Sheet1!$C$2:$D$495,2,0)","v":"DIMAS AJI PRASETYO"},"17.11.0242","A","Sama"]
[15,170001,"DITA FERDIAN BAYU KUSUMA",{"$f":"VLOOKUP(E15,Sheet1!$C$2:$D$495,2,0)","v":"DITA FERDIAN BAYU KUSUMA"},"17.11.0001","B","Sama"]
[16,170041,"EKY SETIAWAN",{"$f":"VLOOKUP(E16,Sheet1!$C$2:$D$495,2,0)","v":"EKY SETIAWAN"},"17.12.0003","A","Sama"]
[17,170035,"ENTUK AJI NUGROHO",{"$f":"VLOOKUP(E17,Sheet1!$C$2:$D$495,2,0)","v":"ENTUK AJI NUGROHO"},"17.11.0030","A","Sama"]
[18,170004,"GAGAT BASKORO SYAH",{"$f":"VLOOKUP(E18,Sheet1!$C$2:$D$495,2,0)","v":"GAGAT BASKORO SYAH"},"17.11.0073","A","Sama"]
[19,170019,"GILANG RIZKY MUSTOFA",{"$f":"VLOOKUP(E19,Sheet1!$C$2:$D$495,2,0)","v":"GILANG RIZKY MUSTOFA"},"17.11.0191","C","Sama"]
[20,170012,"IFANIA OKTAVIANI PUTRI",{"$f":"VLOOKUP(E20,Sheet1!$C$2:$D$495,2,0)","v":"IFANIA OKTAVIANI PUTRI"},"17.12.0011","A","Sama"]
[21,170032,"IVAN SURYA WITANTO",{"$f":"VLOOKUP(E21,Sheet1!$C$2:$D$495,2,0)","v":"IVAN SURYA WITANTO"},"17.11.0337","C","Sama"]
[23,170024,"JANUARIO SUBECTI BANO",{"$f":"VLOOKUP(E22,Sheet1!$C$2:$D$495,2,0)","v":"JANUARIO SUBECTI BANO"},"17.11.0003","D","Sama"]
[24,170023,"LABIB FAUZI RAMADAN",{"$f":"VLOOKUP(E23,Sheet1!$C$2:$D$495,2,0)","v":"LABIB FAUZI RAMADAN"},"17.11.0004","A","Sama"]
[25,170049,"LAELATUL ROFIDA",{"$f":"VLOOKUP(E24,Sheet1!$C$2:$D$495,2,0)","v":"LAELATUL ROFIDA"},"17.11.0012","A","Sama"]
[26,170037,"MOHAMAD BAGUS WIDIYANTO",{"$f":"VLOOKUP(E25,Sheet1!$C$2:$D$495,2,0)","v":"MOHAMAD BAGUS WIDIYANTO"},"17.11.0011","C","Sama"]
[27,170026,"NANA SABRINA",{"$f":"VLOOKUP(E26,Sheet1!$C$2:$D$495,2,0)","v":"NANA SABRINA"},"17.11.0005","A","Sama"]
[28,170017,"NUR LAELI RACHMAWATI",{"$f":"VLOOKUP(E27,Sheet1!$C$2:$D$495,2,0)","v":"NUR LAELI RACHMAWATI"},"17.12.0001","A","Sama"]
[30,170016,"RANGGA GUSTI ANANTA",{"$f":"VLOOKUP(E28,Sheet1!$C$2:$D$495,2,0)","v":"RANGGA GUSTI ANANTA"},"17.11.0007","C","Sama"]
[32,170021,"RIAN PRIADI",{"$f":"VLOOKUP(E29,Sheet1!$C$2:$D$495,2,0)","v":"RIAN PRIADI"},"17.11.0043","A","Sama"]
[33,170020,"RIYAN EKO SAPUTRA",{"$f":"VLOOKUP(E30,Sheet1!$C$2:$D$495,2,0)","v":"RIYAN EKO SAPUTRA"},"17.11.0010","D","Sama"]
[34,170006,"RIZQI MUSTHOFA",{"$f":"VLOOKUP(E31,Sheet1!$C$2:$D$495,2,0)","v":"RIZQI MUSTHOFA"},"17.11.0002","A","Sama"]
[1,170015,"ADAM AMIRUDIN",{"$f":"VLOOKUP(E32,Sheet1!$C$2:$D$495,2,0)","v":"ADAM AMIRUDIN"},"17.11.0046","A","Sama"]
[2,170092,"AFIF MA'RUF ESKA",{"$f":"VLOOKUP(E33,Sheet1!$C$2:$D$495,2,0)","v":"AFIF MA'RUF ESKA"},"17.11.0020","A","Sama"]
[3,170064,"ALFIAN KUKUH ADITAMA",{"$f":"VLOOKUP(E34,Sheet1!$C$2:$D$495,2,0)","v":"ALFIAN KUKUH ADITAMA"},"17.11.0229","A","Sama"]
[4,170063,"APRILIA MELI KRISTINA",{"$f":"VLOOKUP(E35,Sheet1!$C$2:$D$495,2,0)","v":"APRILIA MELI KRISTINA"},"17.12.0067","A","Sama"]
[5,170053,"ARIF SUPRIYONO",{"$f":"VLOOKUP(E36,Sheet1!$C$2:$D$495,2,0)","v":"ARIF SUPRIYONO"},"17.11.0044","A","Sama"]
[6,170072,"ASEP SETIAJI",{"$f":"VLOOKUP(E37,Sheet1!$C$2:$D$495,2,0)","v":"ASEP SETIAJI"},"17.11.0024","A","Sama"]
[7,170030,"CANDRA YANUAR DWI  NURCAHYO",{"$f":"VLOOKUP(E38,Sheet1!$C$2:$D$495,2,0)","v":"CANDRA YANUAR DWI  NURCAHYO"},"17.11.0019","A","Sama"]
[8,170060,"DARMORO WINANJAR SASMIKO",{"$f":"VLOOKUP(E39,Sheet1!$C$2:$D$495,2,0)","v":"DARMORO WINANJAR SASMIKO"},"17.11.0023","D","Sama"]
[9,170055,"DEDY ISTIADY PUJIANADA",{"$f":"VLOOKUP(E40,Sheet1!$C$2:$D$495,2,0)","v":"DEDY ISTIADY PUJIANADA"},"17.11.0033","A","Sama"]
[10,170042,"ESA DAMAYANTI",{"$f":"VLOOKUP(E41,Sheet1!$C$2:$D$495,2,0)","v":"ESA DAMAYANTI"},"17.12.0122","D","Sama"]
[11,170083,"FARRIS AMRULLAH",{"$f":"VLOOKUP(E42,Sheet1!$C$2:$D$495,2,0)","v":"FARRIS AMRULLAH"},"17.12.0123","A","Sama"]
[12,170045,"FAUZAN AJI",{"$f":"VLOOKUP(E43,Sheet1!$C$2:$D$495,2,0)","v":"FAUZAN AJI"},"17.11.0034","A","Sama"]
[13,170062,"FIQRI OCKAS PERDANA",{"$f":"VLOOKUP(E44,Sheet1!$C$2:$D$495,2,0)","v":"FIQRI OCKAS PERDANA"},"17.11.0050","B","Sama"]
[14,170034,"JUAN SEBACHTIAN",{"$f":"VLOOKUP(E45,Sheet1!$C$2:$D$495,2,0)","v":"JUAN SEBACHTIAN"},"17.11.0037","A","Sama"]
[15,170082,"KURNIAWAN SAPUTRA",{"$f":"VLOOKUP(E46,Sheet1!$C$2:$D$495,2,0)","v":"KURNIAWAN SAPUTRA"},"17.11.0018","A","Sama"]
[16,170068,"MOHAMMAD RIZALDI PRADANA",{"$f":"VLOOKUP(E47,Sheet1!$C$2:$D$495,2,0)","v":"MOHAMMAD RIZALDI PRADANA"},"17.11.0162","A","Sama"]
[17,170089,"MUHAMAD MACHFUDZ ALDIANSYAH",{"$f":"VLOOKUP(E48,Sheet1!$C$2:$D$495,2,0)","v":"MUHAMAD MACHFUDZ ALDIANSYAH"},"17.11.0186","A","Sama"]
[18,170061,"PURBO DWI ANGGORO",{"$f":"VLOOKUP(E49,Sheet1!$C$2:$D$495,2,0)","v":"PURBO DWI ANGGORO"},"17.11.0245","B","Sama"]
[19,170071,"PUTU LEO KHARISMA BANGSA",{"$f":"VLOOKUP(E50,Sheet1!$C$2:$D$495,2,0)","v":"PUTU LEO KHARISMA BANGSA"},"17.11.0027","D","Sama"]
[21,170077,"RIJAL AMRI MAJID",{"$f":"VLOOKUP(E51,Sheet1!$C$2:$D$495,2,0)","v":"RIJAL AMRI MAJID"},"17.11.0248","A","Sama"]
[23,170067,"ROFI SUSI NUR FATIMAH",{"$f":"VLOOKUP(E52,Sheet1!$C$2:$D$495,2,0)","v":"ROFI SUSI NUR FATIMAH"},"17.12.0009","A","Sama"]
[24,170073,"SEPTIAN PRIMANSYAH",{"$f":"VLOOKUP(E53,Sheet1!$C$2:$D$495,2,0)","v":"SEPTIAN PRIMANSYAH"},"17.11.0014","A","Sama"]
[25,170057,"SETYO PRIMA AJI",{"$f":"VLOOKUP(E54,Sheet1!$C$2:$D$495,2,0)","v":"SETYO PRIMA AJI"},"17.11.0297","B","Sama"]
[27,170059,"WAHYU SURYO NUROHMAN",{"$f":"VLOOKUP(E55,Sheet1!$C$2:$D$495,2,0)","v":"WAHYU SURYO NUROHMAN"},"17.11.0244","A","Sama"]
[28,170084,"WHISNU ADAM FATHURROKHMAN",{"$f":"VLOOKUP(E56,Sheet1!$C$2:$D$495,2,0)","v":"WHISNU ADAM FATHURROKHMAN"},"17.11.0247","A","Sama"]
[29,170070,"WISNU PRASETYA",{"$f":"VLOOKUP(E57,Sheet1!$C$2:$D$495,2,0)","v":"WISNU PRASETYA"},"17.11.0031","A","Sama"]
[30,170069,"YUSUF SUPRIYATNA",{"$f":"VLOOKUP(E58,Sheet1!$C$2:$D$495,2,0)","v":"YUSUF SUPRIYATNA"},"17.11.0017","A","Sama"]
[31,170168,"DEWI SULISTYOWATI",{"$f":"VLOOKUP(E59,Sheet1!$C$2:$D$495,2,0)","v":"DEWI SULISTYOWATI"},"17.12.0154","A","Sama"]
[32,170037,"MOHAMAD BAGUS WIDIYANTO",{"$f":"VLOOKUP(E60,Sheet1!$C$2:$D$495,2,0)","v":"MOHAMAD BAGUS WIDIYANTO"},"17.11.0011","A","Sama"]
[33,170052,"AFFAN AZ ZARQONI",{"$f":"VLOOKUP(E61,Sheet1!$C$2:$D$495,2,0)","v":"AFFAN AZ ZARQONI"},"17.11.0032","A","Sama"]
[34,170161,"ADE TRIO PAMUNGKAS",{"$f":"VLOOKUP(E62,Sheet1!$C$2:$D$495,2,0)","v":"ADE TRIO PAMUNGKAS"},"17.11.0308","A","Sama"]
[1,170133,"ACHMAD FERDIYANSYAH",{"$f":"VLOOKUP(E63,Sheet1!$C$2:$D$495,2,0)","v":"ACHMAD FERDIYANSYAH"},"17.11.0286","A","Sama"]
[2,170109,"ADE IVAN VANANI",{"$f":"VLOOKUP(E64,Sheet1!$C$2:$D$495,2,0)","v":"ADE IVAN VANANI"},"17.12.0016","B","Sama"]
[3,170128,"ADI BUDI PRASETYO",{"$f":"VLOOKUP(E65,Sheet1!$C$2:$D$495,2,0)","v":"ADI BUDI PRASETYO"},"17.11.0167","A","Sama"]
[4,170122,"AFIFUR ROHMAN ZAIN",{"$f":"VLOOKUP(E66,Sheet1!$C$2:$D$495,2,0)","v":"AFIFUR ROHMAN ZAIN"},"17.12.0017","A",{"$f":"IF(C66=D66,\"Sama\",\"Tidak\")","v":"Sama"}]
[5,170096,"AHMAD ALWI RAHMAN",{"$f":"VLOOKUP(E67,Sheet1!$C$2:$D$495,2,0)","v":"AHMAD ALWI RAHMAN"},"17.11.0029","B","Sama"]
[6,170126,"ALDILIYA AINUN MADJID",{"$f":"VLOOKUP(E68,Sheet1!$C$2:$D$495,2,0)","v":"ALDILIYA AINUN MADJID"},"17.11.0130","A","Sama"]
[7,170051,"ARIEF KURNIA RAMADHANI",{"$f":"VLOOKUP(E69,Sheet1!$C$2:$D$495,2,0)","v":"ARIEF KURNIA RAMADHANI"},"17.11.0016","A","Sama"]
[8,170101,"AURORA DWI KHATULISTIAN",{"$f":"VLOOKUP(E70,Sheet1!$C$2:$D$495,2,0)","v":"AURORA DWI KHATULISTIAN"},"17.11.0022","D","Sama"]
[9,170111,"CHRISTIANTO TRI MULYANTO PUTRA",{"$f":"VLOOKUP(E71,Sheet1!$C$2:$D$495,2,0)","v":"CHRISTIANTO TRI MULYANTO PUTRA"},"17.11.0026","B","Sama"]
[10,170132,"DEFRIA ISKANTO",{"$f":"VLOOKUP(E72,Sheet1!$C$2:$D$495,2,0)","v":"DEFRIA ISKANTO"},"17.11.0040","A","Sama"]
[11,170113,"FADHLAN NUR KHAALISH",{"$f":"VLOOKUP(E73,Sheet1!$C$2:$D$495,2,0)","v":"FADHLAN NUR KHAALISH"},"17.12.0014","A","Sama"]
[12,170160,"FARIS KELVIANTO",{"$f":"VLOOKUP(E74,Sheet1!$C$2:$D$495,2,0)","v":"FARIS KELVIANTO"},"17.11.0035","A","Sama"]
[13,170141,"HANINDYA SEKAR PUTRI",{"$f":"VLOOKUP(E75,Sheet1!$C$2:$D$495,2,0)","v":"HANINDYA SEKAR PUTRI"},"17.12.0109","D","Sama"]
[14,170125,"IFHAM MAFTUKHIN",{"$f":"VLOOKUP(E76,Sheet1!$C$2:$D$495,2,0)","v":"IFHAM MAFTUKHIN"},"17.12.0010","A","Sama"]
[16,170058,"KHAIDIR NALAKHUDIN",{"$f":"VLOOKUP(E77,Sheet1!$C$2:$D$495,2,0)","v":"KHAIDIR NALAKHUDIN"},"17.11.0298","B","Sama"]
[17,170116,"KRISNO",{"$f":"VLOOKUP(E78,Sheet1!$C$2:$D$495,2,0)","v":"KRISNO"},"17.11.0036","A","Sama"]
[18,170110,"LISNA YANUAR MUKHLIS",{"$f":"VLOOKUP(E79,Sheet1!$C$2:$D$495,2,0)","v":"LISNA YANUAR MUKHLIS"},"17.11.0066","A","Sama"]
[19,170120,"LUTFI ERIYAN",{"$f":"VLOOKUP(E80,Sheet1!$C$2:$D$495,2,0)","v":"LUTFI ERIYAN"},"17.11.0051","A","Sama"]
[22,170086,"NABILA APRILIANTI",{"$f":"VLOOKUP(E81,Sheet1!$C$2:$D$495,2,0)","v":"NABILA APRILIANTI"},"17.12.0068","A","Sama"]
[23,170107,"NURAZIS ADHIRAMA PAMUNGKAS",{"$f":"VLOOKUP(E82,Sheet1!$C$2:$D$495,2,0)","v":"NURAZIS ADHIRAMA PAMUNGKAS"},"17.11.0038","A","Sama"]
[24,170115,"RAHILA NUR JANAH",{"$f":"VLOOKUP(E83,Sheet1!$C$2:$D$495,2,0)","v":"RAHILA NUR JANAH"},"17.11.0025","A","Sama"]
[27,170112,"SIDIK BAHTIAR",{"$f":"VLOOKUP(E84,Sheet1!$C$2:$D$495,2,0)","v":"SIDIK BAHTIAR"},"17.12.0008","D","Sama"]
[28,170105,"SITI KHUMAEROH",{"$f":"VLOOKUP(E85,Sheet1!$C$2:$D$495,2,0)","v":"SITI KHUMAEROH"},"17.12.0007","A","Sama"]
[31,170048,"TUTI SUPRIATININGSIH",{"$f":"VLOOKUP(E86,Sheet1!$C$2:$D$495,2,0)","v":"TUTI SUPRIATININGSIH"},"17.11.0318","A","Sama"]
[32,170065,"UTAMI DINI PUSPITA",{"$f":"VLOOKUP(E87,Sheet1!$C$2:$D$495,2,0)","v":"UTAMI DINI PUSPITA"},"17.11.0180","A","Sama"]
[34,170119,"YULIANDRI SETIADI",{"$f":"VLOOKUP(E88,Sheet1!$C$2:$D$495,2,0)","v":"YULIANDRI SETIADI"},"17.11.0250","C","Sama"]
[35,170108,"ZULFA AULIA",{"$f":"VLOOKUP(E89,Sheet1!$C$2:$D$495,2,0)","v":"ZULFA AULIA"},"17.12.0006","A","Sama"]
[36,170155,"MOCH ATANAL YAQIN",{"$f":"VLOOKUP(E90,Sheet1!$C$2:$D$495,2,0)","v":"MOCH ATANAL YAQIN"},"17.11.0063","A","Sama"]
[37,170156,"AHMAD HISYAM ADNAN",{"$f":"VLOOKUP(E91,Sheet1!$C$2:$D$495,2,0)","v":"AHMAD HISYAM ADNAN"},"17.11.0062","A","Sama"]
[2,170148,"RIFKI LESTIANTO",{"$f":"VLOOKUP(E92,Sheet1!$C$2:$D$495,2,0)","v":"RIFKI LESTIANTO"},"17.11.0041","A","Sama"]
[6,170176,"ILHAM HAQQI WIJAYA",{"$f":"VLOOKUP(E93,Sheet1!$C$2:$D$495,2,0)","v":"ILHAM HAQQI WIJAYA"},"17.12.0020","A","Sama"]
[9,170189,"YOGA MAULANA",{"$f":"VLOOKUP(E94,Sheet1!$C$2:$D$495,2,0)","v":"YOGA MAULANA"},"17.11.0159","A","Sama"]
[11,170200,"BAHARUDDIN AL FADHILAH",{"$f":"VLOOKUP(E95,Sheet1!$C$2:$D$495,2,0)","v":"BAHARUDDIN AL FADHILAH"},"17.11.0072","B","Sama"]
[17,170181,"ARJUNTORO ARDHY FERDIAN",{"$f":"VLOOKUP(E96,Sheet1!$C$2:$D$495,2,0)","v":"ARJUNTORO ARDHY FERDIAN"},"17.12.0039","A","Sama"]
[18,170204,"MOHAMMAD SHOFYAN FAURI",{"$f":"VLOOKUP(E97,Sheet1!$C$2:$D$495,2,0)","v":"MOHAMMAD SHOFYAN FAURI"},"17.11.0197","A","Sama"]
[25,170163,"ADE PRASTYO",{"$f":"VLOOKUP(E98,Sheet1!$C$2:$D$495,2,0)","v":"ADE PRASTYO"},"17.11.0225","A","Sama"]
[26,170046,"HANA AMBAR FATIK WIBAWA",{"$f":"VLOOKUP(E99,Sheet1!$C$2:$D$495,2,0)","v":"HANA AMBAR FATIK WIBAWA"},"17.12.0077","A","Sama"]
[28,170094,"MUHAMMAD GHOZY LATHIF",{"$f":"VLOOKUP(E100,Sheet1!$C$2:$D$495,2,0)","v":"MUHAMMAD GHOZY LATHIF"},"17.11.0240","C","Sama"]
[29,170095,"SOLEH NUR HAYAT",{"$f":"VLOOKUP(E101,Sheet1!$C$2:$D$495,2,0)","v":"SOLEH NUR HAYAT"},"17.11.0021","A","Sama"]
[30,170139,"LAELI NUR HIDAYATI",{"$f":"VLOOKUP(E102,Sheet1!$C$2:$D$495,2,0)","v":"LAELI NUR HIDAYATI"},"17.11.0252","D","Sama"]
[31,170174,"MUHAMAD IRFANY MUSA",{"$f":"VLOOKUP(E103,Sheet1!$C$2:$D$495,2,0)","v":"MUHAMAD IRFANY MUSA"},"17.11.0253","A","Sama"]
[32,170200,"BAHARUDDIN AL FADHILAH",{"$f":"VLOOKUP(E104,Sheet1!$C$2:$D$495,2,0)","v":"BAHARUDDIN AL FADHILAH"},"17.11.0072","C","Sama"]
[34,170123,"AGUNG BUDI PRASETYO",{"$f":"VLOOKUP(E105,Sheet1!$C$2:$D$495,2,0)","v":"AGUNG BUDI PRASETYO"},"17.11.0227","A","Sama"]
[35,170117,"DITA PURNAMASARI",{"$f":"VLOOKUP(E106,Sheet1!$C$2:$D$495,2,0)","v":"DITA PURNAMASARI"},"17.11.0045","A","Sama"]
[37,170192,"AZHARI RAKHMAT BAKHTIAR",{"$f":"VLOOKUP(E107,Sheet1!$C$2:$D$495,2,0)","v":"AZHARI RAKHMAT BAKHTIAR"},"17.12.0018","A","Sama"]
[1,170075,"FIRMAN WIJAYA",{"$f":"VLOOKUP(E108,Sheet1!$C$2:$D$495,2,0)","v":"FIRMAN WIJAYA"},"17.12.0153","A","Sama"]
[3,170007,"AZIZAN NURHAKIM",{"$f":"VLOOKUP(E109,Sheet1!$C$2:$D$495,2,0)","v":"AZIZAN NURHAKIM"},"17.11.0008","A","Sama"]
[6,170139,"LAELI NUR HIDAYATI",{"$f":"VLOOKUP(E110,Sheet1!$C$2:$D$495,2,0)","v":"LAELI NUR HIDAYATI"},"17.11.0252","A","Sama"]
[7,170103,"ZURNAEN EVAN ZIZA RIADHI",{"$f":"VLOOKUP(E111,Sheet1!$C$2:$D$495,2,0)","v":"ZURNAEN EVAN ZIZA RIADHI"},"17.11.0055","D","Sama"]
[8,170104,"FAISAL ISKA UKHRIZA",{"$f":"VLOOKUP(E112,Sheet1!$C$2:$D$495,2,0)","v":"FAISAL ISKA UKHRIZA"},"17.11.0056","D","Sama"]
[10,170127,"SIMON SOFIAN IWAN WIBOWO",{"$f":"VLOOKUP(E113,Sheet1!$C$2:$D$495,2,0)","v":"SIMON SOFIAN IWAN WIBOWO"},"17.11.0079","D","Sama"]
[17,170123,"AGUNG BUDI PRASETYO",{"$f":"VLOOKUP(E114,Sheet1!$C$2:$D$495,2,0)","v":"AGUNG BUDI PRASETYO"},"17.11.0227","D","Sama"]
[18,170136,"ALDI SETIA PAMBUDI",{"$f":"VLOOKUP(E115,Sheet1!$C$2:$D$495,2,0)","v":"ALDI SETIA PAMBUDI"},"17.11.0057","D","Sama"]
[19,170117,"DITA PURNAMASARI",{"$f":"VLOOKUP(E116,Sheet1!$C$2:$D$495,2,0)","v":"DITA PURNAMASARI"},"17.11.0045","A","Sama"]
[20,170207,"IMAM SYAFII",{"$f":"VLOOKUP(E117,Sheet1!$C$2:$D$495,2,0)","v":"IMAM SYAFII"},"17.11.0053","A","Sama"]
[21,170114,"MASADI DWI KURNIAWAN",{"$f":"VLOOKUP(E118,Sheet1!$C$2:$D$495,2,0)","v":"MASADI DWI KURNIAWAN"},"17.11.0314","A","Sama"]
[22,170224,"TRI MUJI RAHAYU",{"$f":"VLOOKUP(E119,Sheet1!$C$2:$D$495,2,0)","v":"TRI MUJI RAHAYU"},"17.11.0078","A","Sama"]
[29,170246,"TRI HASTOMO",{"$f":"VLOOKUP(E120,Sheet1!$C$2:$D$495,2,0)","v":"TRI HASTOMO"},"17.11.0058","A","Sama"]
[31,170215,"LEIN ITA NURBAETY",{"$f":"VLOOKUP(E121,Sheet1!$C$2:$D$495,2,0)","v":"LEIN ITA NURBAETY"},"17.12.0102","A","Sama"]
[32,170202,"FAZRI JATI HUMANIKA",{"$f":"VLOOKUP(E122,Sheet1!$C$2:$D$495,2,0)","v":"FAZRI JATI HUMANIKA"},"17.11.0254","A","Sama"]
[1,170342,"ARIF SUGIARTO",{"$f":"VLOOKUP(E123,Sheet1!$C$2:$D$495,2,0)","v":"ARIF SUGIARTO"},"17.12.0025","A","Sama"]
[4,170315,"ALDISTYA RIESTA SEKARINI",{"$f":"VLOOKUP(E124,Sheet1!$C$2:$D$495,2,0)","v":"ALDISTYA RIESTA SEKARINI"},"17.12.0024","A","Sama"]
[7,170339,"DEVANDA RIZKI RAMADHAN",{"$f":"VLOOKUP(E125,Sheet1!$C$2:$D$495,2,0)","v":"DEVANDA RIZKI RAMADHAN"},"17.12.0028","A","Sama"]
[14,170320,"ALFA RIZKI",{"$f":"VLOOKUP(E126,Sheet1!$C$2:$D$495,2,0)","v":"ALFA RIZKI"},"17.11.0177","D","Sama"]
[17,170318,"DISTA TRIANISFI",{"$f":"VLOOKUP(E127,Sheet1!$C$2:$D$495,2,0)","v":"DISTA TRIANISFI"},"17.12.0152","B","Sama"]
[24,170285,"RIZKIYANA CATUR PRADANA",{"$f":"VLOOKUP(E128,Sheet1!$C$2:$D$495,2,0)","v":"RIZKIYANA CATUR PRADANA"},"17.11.0309","A","Sama"]
[2,170029,"CAROKO WASESO YEKTI",{"$f":"VLOOKUP(E129,Sheet1!$C$2:$D$495,2,0)","v":"CAROKO WASESO YEKTI"},"17.11.0104","D","Sama"]
[3,170127,"SIMON SOFIAN IWAN WIBOWO",{"$f":"VLOOKUP(E130,Sheet1!$C$2:$D$495,2,0)","v":"SIMON SOFIAN IWAN WIBOWO"},"17.11.0079","A",{"$f":"IF(C130=D130,\"Sama\",\"Tidak\")","v":"Sama"}]
[6,170227,"FATIN MUSTIKA SARI",{"$f":"VLOOKUP(E131,Sheet1!$C$2:$D$495,2,0)","v":"FATIN MUSTIKA SARI"},"17.12.0089","A","Sama"]
[9,170249,"I NYOMAN PUTHUT WIJAYA",{"$f":"VLOOKUP(E132,Sheet1!$C$2:$D$495,2,0)","v":"I NYOMAN PUTHUT WIJAYA"},"17.12.0105","A","Sama"]
[10,170251,"DARMAWAN KUSUMA",{"$f":"VLOOKUP(E133,Sheet1!$C$2:$D$495,2,0)","v":"DARMAWAN KUSUMA"},"17.11.0070","D","Sama"]
[16,170265,"DINO PURNAMA AJI",{"$f":"VLOOKUP(E134,Sheet1!$C$2:$D$495,2,0)","v":"DINO PURNAMA AJI"},"17.11.0088","A","Sama"]
[18,170269,"KEVIN ZEFANYA TIRTA IRAWAN",{"$f":"VLOOKUP(E135,Sheet1!$C$2:$D$495,2,0)","v":"KEVIN ZEFANYA TIRTA IRAWAN"},"17.11.0080","D","Sama"]
[24,170290,"WIDYA HANA SAFITRI",{"$f":"VLOOKUP(E136,Sheet1!$C$2:$D$495,2,0)","v":"WIDYA HANA SAFITRI"},"17.12.0033","A","Sama"]
[26,170295,"FAIZ ZURRAHMAN AS SIROZ",{"$f":"VLOOKUP(E137,Sheet1!$C$2:$D$495,2,0)","v":"FAIZ ZURRAHMAN AS SIROZ"},"17.12.0108","B","Sama"]
[27,170297,"UMAM EGA PRATAMA",{"$f":"VLOOKUP(E138,Sheet1!$C$2:$D$495,2,0)","v":"UMAM EGA PRATAMA"},"17.11.0071","D","Sama"]
[32,170305,"MAGHFIRA NURUL ISNAINI",{"$f":"VLOOKUP(E139,Sheet1!$C$2:$D$495,2,0)","v":"MAGHFIRA NURUL ISNAINI"},"17.12.0058","A","Sama"]
[34,170313,"SHAFIRA RIZKY",{"$f":"VLOOKUP(E140,Sheet1!$C$2:$D$495,2,0)","v":"SHAFIRA RIZKY"},"17.11.0096","D","Sama"]
[39,170369,"RICKY SUDIYANTO",{"$f":"VLOOKUP(E141,Sheet1!$C$2:$D$495,2,0)","v":"RICKY SUDIYANTO"},"17.11.0215","B","Sama"]
[2,170273,"M.NAFI FANAULKIROM",{"$f":"VLOOKUP(E142,Sheet1!$C$2:$D$495,2,0)","v":"M.NAFI FANAULKIROM"},"17.12.0155","A","Sama"]
[3,170016,"RANGGA GUSTI ANANTA",{"$f":"VLOOKUP(E143,Sheet1!$C$2:$D$495,2,0)","v":"RANGGA GUSTI ANANTA"},"17.11.0007","A","Sama"]
[5,170351,"MUHAMAD HISYAM ZUHDI",{"$f":"VLOOKUP(E144,Sheet1!$C$2:$D$495,2,0)","v":"MUHAMAD HISYAM ZUHDI"},"17.11.0271","D","Sama"]
[8,170336,"MAMAT SUPRIYANTO",{"$f":"VLOOKUP(E145,Sheet1!$C$2:$D$495,2,0)","v":"MAMAT SUPRIYANTO"},"17.11.0081","A","Sama"]
[9,170348,"IMUNG DWI UPAYA",{"$f":"VLOOKUP(E146,Sheet1!$C$2:$D$495,2,0)","v":"IMUNG DWI UPAYA"},"17.11.0082","A","Sama"]
[14,170331,"ACHMAD RUSLIYANSYAH SAFRONI",{"$f":"VLOOKUP(E147,Sheet1!$C$2:$D$495,2,0)","v":"ACHMAD RUSLIYANSYAH SAFRONI"},"17.11.0092","B","Sama"]
[27,170377,"ERIANA ZAHROTUL FIRDAUS",{"$f":"VLOOKUP(E148,Sheet1!$C$2:$D$495,2,0)","v":"ERIANA ZAHROTUL FIRDAUS"},"17.12.0086","D","Sama"]
[30,170241,"DEVI NURAENI",{"$f":"VLOOKUP(E149,Sheet1!$C$2:$D$495,2,0)","v":"DEVI NURAENI"},"17.12.0034","A","Sama"]
[1,170172,"MUHAMMAD SAFRIJAL ZULMI",{"$f":"VLOOKUP(E150,Sheet1!$C$2:$D$495,2,0)","v":"MUHAMMAD SAFRIJAL ZULMI"},"17.12.0037","A","Sama"]
[7,170397,"NUR AZIZ PRAMUDYA",{"$f":"VLOOKUP(E151,Sheet1!$C$2:$D$495,2,0)","v":"NUR AZIZ PRAMUDYA"},"17.11.0135","A","Sama"]
[10,170363,"ZIAD MIQDAD HAQQONI",{"$f":"VLOOKUP(E152,Sheet1!$C$2:$D$495,2,0)","v":"ZIAD MIQDAD HAQQONI"},"17.11.0331","A","Sama"]
[11,170379,"RACHMADDANI",{"$f":"VLOOKUP(E153,Sheet1!$C$2:$D$495,2,0)","v":"RACHMADDANI"},"17.11.0321","A","Sama"]
[13,170211,"CICI WULAN SARI",{"$f":"VLOOKUP(E154,Sheet1!$C$2:$D$495,2,0)","v":"CICI WULAN SARI"},"17.12.0030","A","Sama"]
[15,170320,"ALFA RIZKI",{"$f":"VLOOKUP(E155,Sheet1!$C$2:$D$495,2,0)","v":"ALFA RIZKI"},"17.11.0177","A","Sama"]
[18,170351,"MUHAMAD HISYAM ZUHDI",{"$f":"VLOOKUP(E156,Sheet1!$C$2:$D$495,2,0)","v":"MUHAMAD HISYAM ZUHDI"},"17.11.0271","A","Sama"]
[20,170103,"ZURNAEN EVAN ZIZA RIADHI",{"$f":"VLOOKUP(E157,Sheet1!$C$2:$D$495,2,0)","v":"ZURNAEN EVAN ZIZA RIADHI"},"17.11.0055","A","Sama"]
[21,170104,"FAISAL ISKA UKHRIZA",{"$f":"VLOOKUP(E158,Sheet1!$C$2:$D$495,2,0)","v":"FAISAL ISKA UKHRIZA"},"17.11.0056","A","Sama"]
[22,170313,"SHAFIRA RIZKY",{"$f":"VLOOKUP(E159,Sheet1!$C$2:$D$495,2,0)","v":"SHAFIRA RIZKY"},"17.11.0096","A","Sama"]
[23,170401,"RISQI BAYU PRATAMA",{"$f":"VLOOKUP(E160,Sheet1!$C$2:$D$495,2,0)","v":"RISQI BAYU PRATAMA"},"17.11.0157","A","Sama"]
[28,170251,"DARMAWAN KUSUMA",{"$f":"VLOOKUP(E161,Sheet1!$C$2:$D$495,2,0)","v":"DARMAWAN KUSUMA"},"17.11.0070","A","Sama"]
[30,170297,"UMAM EGA PRATAMA",{"$f":"VLOOKUP(E162,Sheet1!$C$2:$D$495,2,0)","v":"UMAM EGA PRATAMA"},"17.11.0071","A","Sama"]
[35,170029,"CAROKO WASESO YEKTI",{"$f":"VLOOKUP(E163,Sheet1!$C$2:$D$495,2,0)","v":"CAROKO WASESO YEKTI"},"17.11.0104","A","Sama"]
[36,170042,"ESA DAMAYANTI",{"$f":"VLOOKUP(E164,Sheet1!$C$2:$D$495,2,0)","v":"ESA DAMAYANTI"},"17.12.0122","B","Sama"]
[9,170428,"THESSA AYU PARTOYO",{"$f":"VLOOKUP(E165,Sheet1!$C$2:$D$495,2,0)","v":"THESSA AYU PARTOYO"},"17.12.0041","A","Sama"]
[10,170071,"PUTU LEO KHARISMA BANGSA",{"$f":"VLOOKUP(E166,Sheet1!$C$2:$D$495,2,0)","v":"PUTU LEO KHARISMA BANGSA"},"17.11.0027","A","Sama"]
[16,170511,"FERDYNAN ARI RAHMADAN",{"$f":"VLOOKUP(E167,Sheet1!$C$2:$D$495,2,0)","v":"FERDYNAN ARI RAHMADAN"},"17.11.0153","A","Sama"]
[21,170495,"ANGGI RIZKA UTAMI",{"$f":"VLOOKUP(E168,Sheet1!$C$2:$D$495,2,0)","v":"ANGGI RIZKA UTAMI"},"17.12.0138","A","Sama"]
[31,170438,"ROY KRISNA PRATAMA",{"$f":"VLOOKUP(E169,Sheet1!$C$2:$D$495,2,0)","v":"ROY KRISNA PRATAMA"},"17.12.0074","A","Sama"]
[32,170449,"KENDY KUKILA",{"$f":"VLOOKUP(E170,Sheet1!$C$2:$D$495,2,0)","v":"KENDY KUKILA"},"17.11.0156","B","Sama"]
[1,170456,"HANIN SEDI SEPTIAN",{"$f":"VLOOKUP(E171,Sheet1!$C$2:$D$495,2,0)","v":"HANIN SEDI SEPTIAN"},"17.11.0150","B","Sama"]
[7,170408,"INDO CRIS MAXI DEMORE YAN RAMADHANI",{"$f":"VLOOKUP(E172,Sheet1!$C$2:$D$495,2,0)","v":"INDO CRIS MAXI DEMORE YAN RAMADHANI"},"17.11.0205","A","Sama"]
[12,170481,"IRHAM MOHAMAD FADLI",{"$f":"VLOOKUP(E173,Sheet1!$C$2:$D$495,2,0)","v":"IRHAM MOHAMAD FADLI"},"17.11.0152","B","Sama"]
[22,170477,"NABILA AYUNING SAFIRA",{"$f":"VLOOKUP(E174,Sheet1!$C$2:$D$495,2,0)","v":"NABILA AYUNING SAFIRA"},"17.11.0217","A","Sama"]
[28,170460,"GUNTUR EKA PRASETYO",{"$f":"VLOOKUP(E175,Sheet1!$C$2:$D$495,2,0)","v":"GUNTUR EKA PRASETYO"},"17.11.0163","A","Sama"]
[29,170465,"SYAFAAT",{"$f":"VLOOKUP(E176,Sheet1!$C$2:$D$495,2,0)","v":"SYAFAAT"},"17.11.0262","A","Sama"]
[35,170446,"LINTANG AYU LAILATUL JANNAH",{"$f":"VLOOKUP(E177,Sheet1!$C$2:$D$495,2,0)","v":"LINTANG AYU LAILATUL JANNAH"},"17.11.0222","A","Sama"]
[37,170269,"KEVIN ZEFANYA TIRTA IRAWAN",{"$f":"VLOOKUP(E178,Sheet1!$C$2:$D$495,2,0)","v":"KEVIN ZEFANYA TIRTA IRAWAN"},"17.11.0080","A","Sama"]
[3,170522,"LENI SETIANI",{"$f":"VLOOKUP(E179,Sheet1!$C$2:$D$495,2,0)","v":"LENI SETIANI"},"17.12.0056","A","Sama"]
[12,170090,"ANKGRAENI KUSUMA DEWI",{"$f":"VLOOKUP(E180,Sheet1!$C$2:$D$495,2,0)","v":"ANKGRAENI KUSUMA DEWI"},"17.12.0110","A","Sama"]
[17,170449,"KENDY KUKILA",{"$f":"VLOOKUP(E181,Sheet1!$C$2:$D$495,2,0)","v":"KENDY KUKILA"},"17.11.0156","E","Sama"]
[26,170505,"REFIS AULAWY NOOR",{"$f":"VLOOKUP(E182,Sheet1!$C$2:$D$495,2,0)","v":"REFIS AULAWY NOOR"},"17.11.0289","A","Sama"]
[27,170416,"MULKI ALI MUBAROK",{"$f":"VLOOKUP(E183,Sheet1!$C$2:$D$495,2,0)","v":"MULKI ALI MUBAROK"},"17.11.0137","A","Sama"]
[13,170528,"GALIH BAGASKORO",{"$f":"VLOOKUP(E184,Sheet1!$C$2:$D$495,2,0)","v":"GALIH BAGASKORO"},"17.11.0218","A","Sama"]
[20,170195,"MUHAMMAD ASEP ROSYADI",{"$f":"VLOOKUP(E185,Sheet1!$C$2:$D$495,2,0)","v":"MUHAMMAD ASEP ROSYADI"},"17.12.0099","A","Sama"]
[26,170586,"TANJUNG ISNANTIA KENJI",{"$f":"VLOOKUP(E186,Sheet1!$C$2:$D$495,2,0)","v":"TANJUNG ISNANTIA KENJI"},"17.12.0158","A","Sama"]
[33,170575,"DIMAS GONDO UTOMO",{"$f":"VLOOKUP(E187,Sheet1!$C$2:$D$495,2,0)","v":"DIMAS GONDO UTOMO"},"17.12.0107","A","Sama"]
[35,170625,"HASANANTO ZAKARIA",{"$f":"VLOOKUP(E188,Sheet1!$C$2:$D$495,2,0)","v":"HASANANTO ZAKARIA"},"17.11.0208","A","Sama"]
[37,170416,"MULKI ALI MUBAROK",{"$f":"VLOOKUP(E189,Sheet1!$C$2:$D$495,2,0)","v":"MULKI ALI MUBAROK"},"17.11.0137","A","Sama"]
[38,170634,"RAHARDIAN ARIF PRATAMA",{"$f":"VLOOKUP(E190,Sheet1!$C$2:$D$495,2,0)","v":"RAHARDIAN ARIF PRATAMA"},"17.11.0170","A","Sama"]
[39,170636,"AFIFAH ANANDA PUTRI",{"$f":"VLOOKUP(E191,Sheet1!$C$2:$D$495,2,0)","v":"AFIFAH ANANDA PUTRI"},"17.11.0292","A","Sama"]
[40,170642,"ABI FIRMANSYAH",{"$f":"VLOOKUP(E192,Sheet1!$C$2:$D$495,2,0)","v":"ABI FIRMANSYAH"},"17.11.0307","A","Sama"]
[46,170278,"YULISTIANA DEWI",{"$f":"VLOOKUP(E193,Sheet1!$C$2:$D$495,2,0)","v":"YULISTIANA DEWI"},"17.12.0145","A","Sama"]
[51,170650,"ZURAIDA YUNIAR FIRDAUS",{"$f":"VLOOKUP(E194,Sheet1!$C$2:$D$495,2,0)","v":"ZURAIDA YUNIAR FIRDAUS"},"17.12.0141","A",{"$f":"IF(C194=D194,\"Sama\",\"Tidak\")","v":"Sama"}]
[52,170618,"SENDI SETIAWAN",{"$f":"VLOOKUP(E195,Sheet1!$C$2:$D$495,2,0)","v":"SENDI SETIAWAN"},"17.11.0172","A","Sama"]
[53,170146,"MUHAMMAD ANDY HIDAYAT",{"$f":"VLOOKUP(E196,Sheet1!$C$2:$D$495,2,0)","v":"MUHAMMAD ANDY HIDAYAT"},"17.11.0200","A","Sama"]
[54,170019,"GILANG RIZKY MUSTOFA",{"$f":"VLOOKUP(E197,Sheet1!$C$2:$D$495,2,0)","v":"GILANG RIZKY MUSTOFA"},"17.11.0191","A","Sama"]
[55,170525,"ALVIAN MAJID",{"$f":"VLOOKUP(E198,Sheet1!$C$2:$D$495,2,0)","v":"ALVIAN MAJID"},"17.12.0148","A","Sama"]
[56,170344,"KANASTA FIRDAUS",{"$f":"VLOOKUP(E199,Sheet1!$C$2:$D$495,2,0)","v":"KANASTA FIRDAUS"},"17.11.0288","A","Sama"]
[3,170578,"HENDRI KUAT FEBRIANSYAH",{"$f":"VLOOKUP(E200,Sheet1!$C$2:$D$495,2,0)","v":"HENDRI KUAT FEBRIANSYAH"},"17.11.0144","A","Sama"]
[5,170516,"DEA ROMI ANGGRAENI",{"$f":"VLOOKUP(E201,Sheet1!$C$2:$D$495,2,0)","v":"DEA ROMI ANGGRAENI"},"17.12.0143","A","Sama"]
[7,170326,"FANDI YULIANTO",{"$f":"VLOOKUP(E202,Sheet1!$C$2:$D$495,2,0)","v":"FANDI YULIANTO"},"17.11.0226","A","Sama"]
[12,170444,"JIMMY HANDRIANSYAH",{"$f":"VLOOKUP(E203,Sheet1!$C$2:$D$495,2,0)","v":"JIMMY HANDRIANSYAH"},"17.11.0105","A","Sama"]
[15,170440,"WINDIANINGSIH",{"$f":"VLOOKUP(E204,Sheet1!$C$2:$D$495,2,0)","v":"WINDIANINGSIH"},"17.11.0232","A","Sama"]
[27,170608,"ELFARIANI MIFTAKHUL JANAH",{"$f":"VLOOKUP(E205,Sheet1!$C$2:$D$495,2,0)","v":"ELFARIANI MIFTAKHUL JANAH"},"17.12.0116","A","Sama"]
[29,170121,"ANGGRI PANJI ERMAYA",{"$f":"VLOOKUP(E206,Sheet1!$C$2:$D$495,2,0)","v":"ANGGRI PANJI ERMAYA"},"17.11.0323","A","Sama"]
[32,170620,"DWI MEILIANA",{"$f":"VLOOKUP(E207,Sheet1!$C$2:$D$495,2,0)","v":"DWI MEILIANA"},"17.12.0098","A","Sama"]
[33,170630,"MOHAMMAD RAYHAN ALMADANI",{"$f":"VLOOKUP(E208,Sheet1!$C$2:$D$495,2,0)","v":"MOHAMMAD RAYHAN ALMADANI"},"17.12.0166","A","Sama"]
[38,170549,"LISMA NUR SEPTIANA",{"$f":"VLOOKUP(E209,Sheet1!$C$2:$D$495,2,0)","v":"LISMA NUR SEPTIANA"},"17.12.0062","A","Sama"]
[39,170639,"MUHAMMAD MARSHAL ABDALLAH",{"$f":"VLOOKUP(E210,Sheet1!$C$2:$D$495,2,0)","v":"MUHAMMAD MARSHAL ABDALLAH"},"17.11.0211","A","Sama"]
[40,170648,"AULIA ULINNUHA AL FACHORY",{"$f":"VLOOKUP(E211,Sheet1!$C$2:$D$495,2,0)","v":"AULIA ULINNUHA AL FACHORY"},"17.11.0320","A","Sama"]
[3,170553,"MENIK PURWATI",{"$f":"VLOOKUP(E212,Sheet1!$C$2:$D$495,2,0)","v":"MENIK PURWATI"},"17.12.0060","A","Sama"]
[4,170615,"DIKKA SANY ARGIA",{"$f":"VLOOKUP(E213,Sheet1!$C$2:$D$495,2,0)","v":"DIKKA SANY ARGIA"},"17.12.0132","A","Sama"]
[6,170565,"HANDIKA AJI SAPUTRA",{"$f":"VLOOKUP(E214,Sheet1!$C$2:$D$495,2,0)","v":"HANDIKA AJI SAPUTRA"},"17.12.0115","A","Sama"]
[7,170599,"SATYA FARIZ NUR ANANTO",{"$f":"VLOOKUP(E215,Sheet1!$C$2:$D$495,2,0)","v":"SATYA FARIZ NUR ANANTO"},"17.11.0306","A","Sama"]
[9,170573,"TIKA SOFIANA",{"$f":"VLOOKUP(E216,Sheet1!$C$2:$D$495,2,0)","v":"TIKA SOFIANA"},"17.11.0302","A","Sama"]
[12,170581,"BUDI KURNIAWAN",{"$f":"VLOOKUP(E217,Sheet1!$C$2:$D$495,2,0)","v":"BUDI KURNIAWAN"},"17.12.0121","A","Sama"]
[14,170589,"RIZQI AGUNG SETIA WIBOWO",{"$f":"VLOOKUP(E218,Sheet1!$C$2:$D$495,2,0)","v":"RIZQI AGUNG SETIA WIBOWO"},"17.11.0160","A","Sama"]
[28,170592,"KHAUTAL ADANI",{"$f":"VLOOKUP(E219,Sheet1!$C$2:$D$495,2,0)","v":"KHAUTAL ADANI"},"17.11.0235","A","Sama"]
[29,170612,"RAMADHAN ARIF NURBASKORO",{"$f":"VLOOKUP(E220,Sheet1!$C$2:$D$495,2,0)","v":"RAMADHAN ARIF NURBASKORO"},"17.11.0210","A","Sama"]
[35,170033,"MUHAMMAD RIZA FAUZILLAH",{"$f":"VLOOKUP(E221,Sheet1!$C$2:$D$495,2,0)","v":"MUHAMMAD RIZA FAUZILLAH"},"17.11.0126","A","Sama"]
[36,170085,"FIKRI RAMADHAN",{"$f":"VLOOKUP(E222,Sheet1!$C$2:$D$495,2,0)","v":"FIKRI RAMADHAN"},"17.11.0263","A","Sama"]
[38,170146,"MUHAMMAD ANDY HIDAYAT",{"$f":"VLOOKUP(E223,Sheet1!$C$2:$D$495,2,0)","v":"MUHAMMAD ANDY HIDAYAT"},"17.11.0200","A","Sama"]
[22,170178,"JALUMIYOS RAMADHIANSYAH",{"$f":"VLOOKUP(E224,Sheet1!$C$2:$D$495,2,0)","v":"JALUMIYOS RAMADHIANSYAH"},"17.11.0076","A","Sama"]
[29,170183,"NUR ROCHMAN ALFATONI",{"$f":"VLOOKUP(E225,Sheet1!$C$2:$D$495,2,0)","v":"NUR ROCHMAN ALFATONI"},"17.11.0287","A","Sama"]
[31,170066,"RANGGA PRANGWEDANA JANUWARSA",{"$f":"VLOOKUP(E226,Sheet1!$C$2:$D$495,2,0)","v":"RANGGA PRANGWEDANA JANUWARSA"},"17.11.0013","C","Sama"]
[15,170156,"KARTIKO HAYAT NUGROHO",{"$f":"VLOOKUP(E227,Sheet1!$C$2:$D$495,2,0)","v":"KARTIKO HAYAT NUGROHO"},"17.11.0238","B","Sama"]
[26,170151,"SHAFRIAL AZHAR",{"$f":"VLOOKUP(E228,Sheet1!$C$2:$D$495,2,0)","v":"SHAFRIAL AZHAR"},"17.11.0290","B","Sama"]
[30,170150,"TRIYONO",{"$f":"VLOOKUP(E229,Sheet1!$C$2:$D$495,2,0)","v":"TRIYONO"},"17.11.0328","A","Sama"]
[1,170149,"WAHYU BUDI PRAKOSO",{"$f":"VLOOKUP(E230,Sheet1!$C$2:$D$495,2,0)","v":"WAHYU BUDI PRAKOSO"},"17.11.0039","A","Sama"]
[3,170163,"WILDAN MUBAROK AZZAKKI",{"$f":"VLOOKUP(E231,Sheet1!$C$2:$D$495,2,0)","v":"WILDAN MUBAROK AZZAKKI"},"17.11.0196","A","Sama"]
[4,170152,"FARA NOVI ANA",{"$f":"VLOOKUP(E232,Sheet1!$C$2:$D$495,2,0)","v":"FARA NOVI ANA"},"17.11.0113","D","Sama"]
[5,170148,"MUHAMAD WELLY PRAYOGA",{"$f":"VLOOKUP(E233,Sheet1!$C$2:$D$495,2,0)","v":"MUHAMAD WELLY PRAYOGA"},"17.12.0126","A","Sama"]
[7,170196,"YASMIN BUDIWATI",{"$f":"VLOOKUP(E234,Sheet1!$C$2:$D$495,2,0)","v":"YASMIN BUDIWATI"},"17.12.0015","A","Sama"]
[8,170165,"FIQRI ADRIANSYAH",{"$f":"VLOOKUP(E235,Sheet1!$C$2:$D$495,2,0)","v":"FIQRI ADRIANSYAH"},"17.11.0131","A","Sama"]
[10,170169,"DEDE IRAWAN",{"$f":"VLOOKUP(E236,Sheet1!$C$2:$D$495,2,0)","v":"DEDE IRAWAN"},"17.11.0202","A","Sama"]
[12,170185,"ADHI LATIEF MUKTIANA",{"$f":"VLOOKUP(E237,Sheet1!$C$2:$D$495,2,0)","v":"ADHI LATIEF MUKTIANA"},"17.11.0237","A","Sama"]
[13,170204,"ADITYA DAMARJATI",{"$f":"VLOOKUP(E238,Sheet1!$C$2:$D$495,2,0)","v":"ADITYA DAMARJATI"},"17.11.0194","A","Sama"]
[14,170182,"FAISAL RIYADI",{"$f":"VLOOKUP(E239,Sheet1!$C$2:$D$495,2,0)","v":"FAISAL RIYADI"},"17.11.0068","A","Sama"]
[15,170168,"MUKJIZAT SETIO NUGROHO",{"$f":"VLOOKUP(E240,Sheet1!$C$2:$D$495,2,0)","v":"MUKJIZAT SETIO NUGROHO"},"17.11.0164","A","Sama"]
[19,170192,"IRVAN EKA ZAENALDI",{"$f":"VLOOKUP(E241,Sheet1!$C$2:$D$495,2,0)","v":"IRVAN EKA ZAENALDI"},"17.11.0084","A","Sama"]
[21,170177,"AULIA PUSPITA ANTARUSMARA",{"$f":"VLOOKUP(E242,Sheet1!$C$2:$D$495,2,0)","v":"AULIA PUSPITA ANTARUSMARA"},"17.12.0065","A","Sama"]
[22,170189,"ANISA UMMUL LATIFAH",{"$f":"VLOOKUP(E243,Sheet1!$C$2:$D$495,2,0)","v":"ANISA UMMUL LATIFAH"},"17.12.0159","D","Sama"]
[23,170176,"IKHFANDA DWI PURNOMO",{"$f":"VLOOKUP(E244,Sheet1!$C$2:$D$495,2,0)","v":"IKHFANDA DWI PURNOMO"},"17.11.0338","A","Sama"]
[24,170172,"AI FADJAR ALDIADI",{"$f":"VLOOKUP(E245,Sheet1!$C$2:$D$495,2,0)","v":"AI FADJAR ALDIADI"},"17.11.0168","A","Sama"]
[2,170184,"ANDRIANUS AGUNG NUGROHO",{"$f":"VLOOKUP(E246,Sheet1!$C$2:$D$495,2,0)","v":"ANDRIANUS AGUNG NUGROHO"},"17.11.0193","A","Sama"]
[4,170212,"IHWAN PRASETIO",{"$f":"VLOOKUP(E247,Sheet1!$C$2:$D$495,2,0)","v":"IHWAN PRASETIO"},"17.11.0052","D","Sama"]
[5,170197,"M.FIQIH FADLI ILMAWAN",{"$f":"VLOOKUP(E248,Sheet1!$C$2:$D$495,2,0)","v":"M.FIQIH FADLI ILMAWAN"},"17.12.0048","A","Sama"]
[9,170227,"MARIA SEKAR ANJANI",{"$f":"VLOOKUP(E249,Sheet1!$C$2:$D$495,2,0)","v":"MARIA SEKAR ANJANI"},"17.12.0169","A","Sama"]
[11,170224,"DWI JOKO PURNOMO",{"$f":"VLOOKUP(E250,Sheet1!$C$2:$D$495,2,0)","v":"DWI JOKO PURNOMO"},"17.11.0188","A","Sama"]
[12,170230,"REIYVAL WILIM PRATAMA",{"$f":"VLOOKUP(E251,Sheet1!$C$2:$D$495,2,0)","v":"REIYVAL WILIM PRATAMA"},"17.11.0054","D","Sama"]
[13,170211,"MOCHAMMAD OBBY SYECH FRUDDIN",{"$f":"VLOOKUP(E252,Sheet1!$C$2:$D$495,2,0)","v":"MOCHAMMAD OBBY SYECH FRUDDIN"},"17.12.0021","A","Sama"]
[14,170173,"RINA ELMI SOFIANA",{"$f":"VLOOKUP(E253,Sheet1!$C$2:$D$495,2,0)","v":"RINA ELMI SOFIANA"},"17.11.0151","D","Sama"]
[15,170237,"ALFANDI RIFQI WIDYADANA",{"$f":"VLOOKUP(E254,Sheet1!$C$2:$D$495,2,0)","v":"ALFANDI RIFQI WIDYADANA"},"17.11.0099","A","Sama"]
[16,170164,"WISNU PAMUNGKAS",{"$f":"VLOOKUP(E255,Sheet1!$C$2:$D$495,2,0)","v":"WISNU PAMUNGKAS"},"17.11.0305","D","Sama"]
[24,170238,"HERMAWAN DWI PRAYITNO",{"$f":"VLOOKUP(E256,Sheet1!$C$2:$D$495,2,0)","v":"HERMAWAN DWI PRAYITNO"},"17.11.0087","A","Sama"]
[26,170232,"JULI MAULANA",{"$f":"VLOOKUP(E257,Sheet1!$C$2:$D$495,2,0)","v":"JULI MAULANA"},"17.11.0098","A","Sama"]
[27,170246,"ZSA ZSA GRACIA SUPRIANTO",{"$f":"VLOOKUP(E258,Sheet1!$C$2:$D$495,2,0)","v":"ZSA ZSA GRACIA SUPRIANTO"},"17.11.0183","A",{"$f":"IF(C258=D258,\"Sama\",\"Tidak\")","v":"Sama"}]
[28,170216,"ANWAR BUDHI DHARMAWAN",{"$f":"VLOOKUP(E259,Sheet1!$C$2:$D$495,2,0)","v":"ANWAR BUDHI DHARMAWAN"},"17.11.0257","A","Sama"]
[30,170221,"BELLA AGUSTIA",{"$f":"VLOOKUP(E260,Sheet1!$C$2:$D$495,2,0)","v":"BELLA AGUSTIA"},"17.11.0060","A","Sama"]
[33,170242,"AMELIA MAWADDAH ALFATHANI",{"$f":"VLOOKUP(E261,Sheet1!$C$2:$D$495,2,0)","v":"AMELIA MAWADDAH ALFATHANI"},"17.12.0111","A","Sama"]
[34,170235,"HUSNI HAMZAH",{"$f":"VLOOKUP(E262,Sheet1!$C$2:$D$495,2,0)","v":"HUSNI HAMZAH"},"17.11.0119","A","Sama"]
[35,170239,"DESTY SANDRA UTAMI",{"$f":"VLOOKUP(E263,Sheet1!$C$2:$D$495,2,0)","v":"DESTY SANDRA UTAMI"},"17.12.0027","A","Sama"]
[36,170300,"AMMAR SHOLEH ARYANTO",{"$f":"VLOOKUP(E264,Sheet1!$C$2:$D$495,2,0)","v":"AMMAR SHOLEH ARYANTO"},"17.11.0116","A","Sama"]
[37,170251,"NAUFAL GUSNI JANUNG PANGKAR",{"$f":"VLOOKUP(E265,Sheet1!$C$2:$D$495,2,0)","v":"NAUFAL GUSNI JANUNG PANGKAR"},"17.11.0065","A","Sama"]
[2,170275,"ELIAS NABIL",{"$f":"VLOOKUP(E266,Sheet1!$C$2:$D$495,2,0)","v":"ELIAS NABIL"},"17.11.0233","B","Sama"]
[3,170286,"MIQDAR ALFI SYAHRIN",{"$f":"VLOOKUP(E267,Sheet1!$C$2:$D$495,2,0)","v":"MIQDAR ALFI SYAHRIN"},"17.11.0299","A","Sama"]
[5,170301,"EDI IMAM MUTAQIN",{"$f":"VLOOKUP(E268,Sheet1!$C$2:$D$495,2,0)","v":"EDI IMAM MUTAQIN"},"17.11.0090","A","Sama"]
[6,170290,"MU'AZIZ FAJARUDIN",{"$f":"VLOOKUP(E269,Sheet1!$C$2:$D$495,2,0)","v":"MU'AZIZ FAJARUDIN"},"17.11.0094","A","Sama"]
[8,170321,"BAHAR NURRUS CHANDRA ALAMSYAH",{"$f":"VLOOKUP(E270,Sheet1!$C$2:$D$495,2,0)","v":"BAHAR NURRUS CHANDRA ALAMSYAH"},"17.12.0026","A","Sama"]
[9,170345,"MUHAMMAD RAHMAT HADIYAMIN",{"$f":"VLOOKUP(E271,Sheet1!$C$2:$D$495,2,0)","v":"MUHAMMAD RAHMAT HADIYAMIN"},"17.11.0147","D","Sama"]
[10,170342,"TRI SEPTI WIDI YANTI",{"$f":"VLOOKUP(E272,Sheet1!$C$2:$D$495,2,0)","v":"TRI SEPTI WIDI YANTI"},"17.12.0101","A","Sama"]
[11,170332,"FADILLAH ANSORI",{"$f":"VLOOKUP(E273,Sheet1!$C$2:$D$495,2,0)","v":"FADILLAH ANSORI"},"17.11.0095","D","Sama"]
[12,170344,"JEFFRI IRAWAN",{"$f":"VLOOKUP(E274,Sheet1!$C$2:$D$495,2,0)","v":"JEFFRI IRAWAN"},"17.11.0107","A","Sama"]
[15,170229,"UBAIDILLAH AHMAD",{"$f":"VLOOKUP(E275,Sheet1!$C$2:$D$495,2,0)","v":"UBAIDILLAH AHMAD"},"17.11.0270","A","Sama"]
[16,170253,"SUCI AMALIA",{"$f":"VLOOKUP(E276,Sheet1!$C$2:$D$495,2,0)","v":"SUCI AMALIA"},"17.12.0029","A","Sama"]
[18,170252,"ARRYAN SETIAWAN",{"$f":"VLOOKUP(E277,Sheet1!$C$2:$D$495,2,0)","v":"ARRYAN SETIAWAN"},"17.11.0256","A","Sama"]
[19,170255,"HASNA ENDAH SAPTAWATI",{"$f":"VLOOKUP(E278,Sheet1!$C$2:$D$495,2,0)","v":"HASNA ENDAH SAPTAWATI"},"17.11.0255","A","Sama"]
[20,170306,"CHOLIVIA INTAN NUR SAFITRI",{"$f":"VLOOKUP(E279,Sheet1!$C$2:$D$495,2,0)","v":"CHOLIVIA INTAN NUR SAFITRI"},"17.12.0063","A","Sama"]
[22,170257,"YUDHISTIRA JANICE AL SAVA",{"$f":"VLOOKUP(E280,Sheet1!$C$2:$D$495,2,0)","v":"YUDHISTIRA JANICE AL SAVA"},"17.11.0158","A","Sama"]
[23,170152,"FARA NOVI ANA",{"$f":"VLOOKUP(E281,Sheet1!$C$2:$D$495,2,0)","v":"FARA NOVI ANA"},"17.11.0113","A","Sama"]
[25,170305,"ANANG SUDARMAYA",{"$f":"VLOOKUP(E282,Sheet1!$C$2:$D$495,2,0)","v":"ANANG SUDARMAYA"},"17.11.0187","A","Sama"]
[26,170241,"HENDI PRADANA",{"$f":"VLOOKUP(E283,Sheet1!$C$2:$D$495,2,0)","v":"HENDI PRADANA"},"17.12.0032","A","Sama"]
[27,170215,"ASIF BAHRIA",{"$f":"VLOOKUP(E284,Sheet1!$C$2:$D$495,2,0)","v":"ASIF BAHRIA"},"17.12.0023","A","Sama"]
[28,170373,"WAHYU NUGROHO",{"$f":"VLOOKUP(E285,Sheet1!$C$2:$D$495,2,0)","v":"WAHYU NUGROHO"},"17.11.0267","A","Sama"]
[1,170233,"ILHAM ALFAN HIDAYAT",{"$f":"VLOOKUP(E286,Sheet1!$C$2:$D$495,2,0)","v":"ILHAM ALFAN HIDAYAT"},"17.11.0061","A","Sama"]
[4,170183,"NUR ROCHMAN ALFATONI",{"$f":"VLOOKUP(E287,Sheet1!$C$2:$D$495,2,0)","v":"NUR ROCHMAN ALFATONI"},"17.11.0287","D","Sama"]
[5,170208,"TEGAR AFIF ASHARI",{"$f":"VLOOKUP(E288,Sheet1!$C$2:$D$495,2,0)","v":"TEGAR AFIF ASHARI"},"17.11.0324","A","Sama"]
[8,170234,"ILHAM AKBAR HABIBIE",{"$f":"VLOOKUP(E289,Sheet1!$C$2:$D$495,2,0)","v":"ILHAM AKBAR HABIBIE"},"17.11.0114","A","Sama"]
[11,170254,"BRILIAN ALFAIN NUSA BHAKTI",{"$f":"VLOOKUP(E290,Sheet1!$C$2:$D$495,2,0)","v":"BRILIAN ALFAIN NUSA BHAKTI"},"17.11.0067","B","Sama"]
[12,170256,"RIZQI GILANG RAMADHAN",{"$f":"VLOOKUP(E291,Sheet1!$C$2:$D$495,2,0)","v":"RIZQI GILANG RAMADHAN"},"17.11.0097","D","Sama"]
[13,170259,"RETNO DWI GUSTI HENDARWESTI",{"$f":"VLOOKUP(E292,Sheet1!$C$2:$D$495,2,0)","v":"RETNO DWI GUSTI HENDARWESTI"},"17.12.0031","A","Sama"]
[14,170260,"YOGA AGUNG PRABOWO",{"$f":"VLOOKUP(E293,Sheet1!$C$2:$D$495,2,0)","v":"YOGA AGUNG PRABOWO"},"17.11.0064","A","Sama"]
[15,170261,"SETIANINGSIH",{"$f":"VLOOKUP(E294,Sheet1!$C$2:$D$495,2,0)","v":"SETIANINGSIH"},"17.11.0122","A","Sama"]
[17,170265,"GAGAH WINASIS",{"$f":"VLOOKUP(E295,Sheet1!$C$2:$D$495,2,0)","v":"GAGAH WINASIS"},"17.11.0117","A","Sama"]
[19,170270,"LUTFI NUR DIANTO",{"$f":"VLOOKUP(E296,Sheet1!$C$2:$D$495,2,0)","v":"LUTFI NUR DIANTO"},"17.11.0086","A","Sama"]
[20,170278,"ABIDIN HIDAYANTO",{"$f":"VLOOKUP(E297,Sheet1!$C$2:$D$495,2,0)","v":"ABIDIN HIDAYANTO"},"17.11.0083","A","Sama"]
[21,170279,"RAFFI ANDIKA PRADANA",{"$f":"VLOOKUP(E298,Sheet1!$C$2:$D$495,2,0)","v":"RAFFI ANDIKA PRADANA"},"17.12.0072","A","Sama"]
[23,170281,"ARIF NUGROHO AJI",{"$f":"VLOOKUP(E299,Sheet1!$C$2:$D$495,2,0)","v":"ARIF NUGROHO AJI"},"17.11.0069","A","Sama"]
[25,170291,"MUFID ARZUDA",{"$f":"VLOOKUP(E300,Sheet1!$C$2:$D$495,2,0)","v":"MUFID ARZUDA"},"17.11.0300","A","Sama"]
[28,170297,"INSAN IKHLASUL AMAL",{"$f":"VLOOKUP(E301,Sheet1!$C$2:$D$495,2,0)","v":"INSAN IKHLASUL AMAL"},"17.11.0110","A","Sama"]
[29,170298,"RENO DERMAWAN MUTIARA PUTRA",{"$f":"VLOOKUP(E302,Sheet1!$C$2:$D$495,2,0)","v":"RENO DERMAWAN MUTIARA PUTRA"},"17.11.0111","A","Sama"]
[30,170299,"AMALIA WAHYU UTAMI",{"$f":"VLOOKUP(E303,Sheet1!$C$2:$D$495,2,0)","v":"AMALIA WAHYU UTAMI"},"17.12.0035","A","Sama"]
[31,170302,"ZIDA KUMALA SA'ADAH",{"$f":"VLOOKUP(E304,Sheet1!$C$2:$D$495,2,0)","v":"ZIDA KUMALA SA'ADAH"},"17.11.0093","A","Sama"]
[35,170323,"DAVA YURISDIKA",{"$f":"VLOOKUP(E305,Sheet1!$C$2:$D$495,2,0)","v":"DAVA YURISDIKA"},"17.11.0075","A","Sama"]
[36,170348,"CANDRA SANTIKA",{"$f":"VLOOKUP(E306,Sheet1!$C$2:$D$495,2,0)","v":"CANDRA SANTIKA"},"17.11.0074","A","Sama"]
[37,170353,"RAHMA SARI FAUZIYAH",{"$f":"VLOOKUP(E307,Sheet1!$C$2:$D$495,2,0)","v":"RAHMA SARI FAUZIYAH"},"17.12.0130","A","Sama"]
[38,170354,"RAHMI SARI FAUZIYAH",{"$f":"VLOOKUP(E308,Sheet1!$C$2:$D$495,2,0)","v":"RAHMI SARI FAUZIYAH"},"17.12.0129","A","Sama"]
[1,170327,"IKBAL GALIH NURPAMUNGKAS",{"$f":"VLOOKUP(E309,Sheet1!$C$2:$D$495,2,0)","v":"IKBAL GALIH NURPAMUNGKAS"},"17.12.0142","A","Sama"]
[4,170326,"ARIEF MIFTAH NUR FAIZI",{"$f":"VLOOKUP(E310,Sheet1!$C$2:$D$495,2,0)","v":"ARIEF MIFTAH NUR FAIZI"},"17.11.0343","A","Sama"]
[6,170269,"KURNIA HANDARA",{"$f":"VLOOKUP(E311,Sheet1!$C$2:$D$495,2,0)","v":"KURNIA HANDARA"},"17.11.0154","D","Sama"]
[10,170307,"RYAN IBNU RIZKYARDHANA",{"$f":"VLOOKUP(E312,Sheet1!$C$2:$D$495,2,0)","v":"RYAN IBNU RIZKYARDHANA"},"17.12.0103","A","Sama"]
[11,170351,"DHIMAS BANYU PERWITA",{"$f":"VLOOKUP(E313,Sheet1!$C$2:$D$495,2,0)","v":"DHIMAS BANYU PERWITA"},"17.12.0136","A","Sama"]
[13,170331,"PUTRI DWI ERFIYANTI",{"$f":"VLOOKUP(E314,Sheet1!$C$2:$D$495,2,0)","v":"PUTRI DWI ERFIYANTI"},"17.11.0142","A","Sama"]
[15,170328,"LUSY RAHMAWAN PANGESTU",{"$f":"VLOOKUP(E315,Sheet1!$C$2:$D$495,2,0)","v":"LUSY RAHMAWAN PANGESTU"},"17.12.0054","D","Sama"]
[16,170369,"DONI HIDAYAT",{"$f":"VLOOKUP(E316,Sheet1!$C$2:$D$495,2,0)","v":"DONI HIDAYAT"},"17.11.0089","A","Sama"]
[17,170333,"GIRI INDAH UMBARAWATI",{"$f":"VLOOKUP(E317,Sheet1!$C$2:$D$495,2,0)","v":"GIRI INDAH UMBARAWATI"},"17.12.0156","A","Sama"]
[18,170370,"ULUNG BUDI HARTONO",{"$f":"VLOOKUP(E318,Sheet1!$C$2:$D$495,2,0)","v":"ULUNG BUDI HARTONO"},"17.12.0049","A","Sama"]
[19,170363,"MUHAMMAD RIFQI ARIYADI",{"$f":"VLOOKUP(E319,Sheet1!$C$2:$D$495,2,0)","v":"MUHAMMAD RIFQI ARIYADI"},"17.11.0138","B","Sama"]
[20,170366,"SINGGIH SYAFRIZAL",{"$f":"VLOOKUP(E320,Sheet1!$C$2:$D$495,2,0)","v":"SINGGIH SYAFRIZAL"},"17.11.0304","D","Sama"]
[21,170320,"AGUNG PUTRA PRATAMA",{"$f":"VLOOKUP(E321,Sheet1!$C$2:$D$495,2,0)","v":"AGUNG PUTRA PRATAMA"},"17.11.0258","A","Sama"]
[24,170365,"SITI AMALIAH",{"$f":"VLOOKUP(E322,Sheet1!$C$2:$D$495,2,0)","v":"SITI AMALIAH"},"17.12.0134","C",{"$f":"IF(C322=D322,\"Sama\",\"Tidak\")","v":"Sama"}]
[25,170374,"INDRA ALAN NUGROHO",{"$f":"VLOOKUP(E323,Sheet1!$C$2:$D$495,2,0)","v":"INDRA ALAN NUGROHO"},"17.11.0181","D","Sama"]
[26,170195,"WAWA MAISA FINANTO",{"$f":"VLOOKUP(E324,Sheet1!$C$2:$D$495,2,0)","v":"WAWA MAISA FINANTO"},"17.11.0273","A","Sama"]
[29,170385,"EKA SUCI NOPIE HANTARI",{"$f":"VLOOKUP(E325,Sheet1!$C$2:$D$495,2,0)","v":"EKA SUCI NOPIE HANTARI"},"17.11.0145","D","Sama"]
[2,170374,"INDRA ALAN NUGROHO",{"$f":"VLOOKUP(E326,Sheet1!$C$2:$D$495,2,0)","v":"INDRA ALAN NUGROHO"},"17.11.0181","A","Sama"]
[3,170381,"HERAYA FITRA",{"$f":"VLOOKUP(E327,Sheet1!$C$2:$D$495,2,0)","v":"HERAYA FITRA"},"17.12.0100","A","Sama"]
[5,170258,"MUHAMMAD IKHSAN NURDIN",{"$f":"VLOOKUP(E328,Sheet1!$C$2:$D$495,2,0)","v":"MUHAMMAD IKHSAN NURDIN"},"17.12.0047","B","Sama"]
[8,170404,"SEPTA AGENG NUGROHO",{"$f":"VLOOKUP(E329,Sheet1!$C$2:$D$495,2,0)","v":"SEPTA AGENG NUGROHO"},"17.12.0137","A","Sama"]
[9,170383,"ISTI ROHAYATUN",{"$f":"VLOOKUP(E330,Sheet1!$C$2:$D$495,2,0)","v":"ISTI ROHAYATUN"},"17.12.0071","A","Sama"]
[12,170273,"GHAUSHIL BADRI AMIN",{"$f":"VLOOKUP(E331,Sheet1!$C$2:$D$495,2,0)","v":"GHAUSHIL BADRI AMIN"},"17.11.0091","A","Sama"]
[14,170418,"RISKA INDAH NURANI",{"$f":"VLOOKUP(E332,Sheet1!$C$2:$D$495,2,0)","v":"RISKA INDAH NURANI"},"17.12.0081","A","Sama"]
[16,170230,"REIYVAL WILIM PRATAMA",{"$f":"VLOOKUP(E333,Sheet1!$C$2:$D$495,2,0)","v":"REIYVAL WILIM PRATAMA"},"17.11.0054","B","Sama"]
[17,170173,"RINA ELMI SOFIANA",{"$f":"VLOOKUP(E334,Sheet1!$C$2:$D$495,2,0)","v":"RINA ELMI SOFIANA"},"17.11.0151","A","Sama"]
[19,170332,"FADILLAH ANSORI",{"$f":"VLOOKUP(E335,Sheet1!$C$2:$D$495,2,0)","v":"FADILLAH ANSORI"},"17.11.0095","A","Sama"]
[25,170401,"DIYAN WASONO ADHI",{"$f":"VLOOKUP(E336,Sheet1!$C$2:$D$495,2,0)","v":"DIYAN WASONO ADHI"},"17.11.0276","A","Sama"]
[26,170417,"TRIONO ANGGI NUGROHO",{"$f":"VLOOKUP(E337,Sheet1!$C$2:$D$495,2,0)","v":"TRIONO ANGGI NUGROHO"},"17.11.0176","A","Sama"]
[27,170528,"GILANG NUR ALFIAN",{"$f":"VLOOKUP(E338,Sheet1!$C$2:$D$495,2,0)","v":"GILANG NUR ALFIAN"},"17.11.0179","A","Sama"]
[29,170274,"RISKI RAHMATULOH",{"$f":"VLOOKUP(E339,Sheet1!$C$2:$D$495,2,0)","v":"RISKI RAHMATULOH"},"17.11.0148","A","Sama"]
[31,170256,"RIZQI GILANG RAMADHAN",{"$f":"VLOOKUP(E340,Sheet1!$C$2:$D$495,2,0)","v":"RIZQI GILANG RAMADHAN"},"17.11.0097","A","Sama"]
[32,170391,"IVAN ZAKA MUBAROK",{"$f":"VLOOKUP(E341,Sheet1!$C$2:$D$495,2,0)","v":"IVAN ZAKA MUBAROK"},"17.12.0117","A","Sama"]
[33,170416,"ABDUL AZIZ",{"$f":"VLOOKUP(E342,Sheet1!$C$2:$D$495,2,0)","v":"ABDUL AZIZ"},"17.11.0102","A","Sama"]
[34,170285,"YUDITYA HARI NUGROHO",{"$f":"VLOOKUP(E343,Sheet1!$C$2:$D$495,2,0)","v":"YUDITYA HARI NUGROHO"},"17.12.0162","A","Sama"]
[2,170431,"BAYU SETIAJI",{"$f":"VLOOKUP(E344,Sheet1!$C$2:$D$495,2,0)","v":"BAYU SETIAJI"},"17.11.0103","A","Sama"]
[3,170424,"RAFI RAMADHAN",{"$f":"VLOOKUP(E345,Sheet1!$C$2:$D$495,2,0)","v":"RAFI RAMADHAN"},"17.11.0101","A","Sama"]
[4,170236,"RIZKY BAKHTIAR",{"$f":"VLOOKUP(E346,Sheet1!$C$2:$D$495,2,0)","v":"RIZKY BAKHTIAR"},"17.11.0100","A","Sama"]
[5,170462,"FAHMI SAPTIAN LUBIS",{"$f":"VLOOKUP(E347,Sheet1!$C$2:$D$495,2,0)","v":"FAHMI SAPTIAN LUBIS"},"17.11.0115","A","Sama"]
[6,170392,"DANI FAISAL",{"$f":"VLOOKUP(E348,Sheet1!$C$2:$D$495,2,0)","v":"DANI FAISAL"},"17.11.0216","A","Sama"]
[7,170397,"SHANDI DESTIAWAN",{"$f":"VLOOKUP(E349,Sheet1!$C$2:$D$495,2,0)","v":"SHANDI DESTIAWAN"},"17.11.0291","A","Sama"]
[8,170440,"REYHAN YUDHISTIRA JUNIAN",{"$f":"VLOOKUP(E350,Sheet1!$C$2:$D$495,2,0)","v":"REYHAN YUDHISTIRA JUNIAN"},"17.12.0040","A","Sama"]
[11,170449,"HARUN SUFAHMI",{"$f":"VLOOKUP(E351,Sheet1!$C$2:$D$495,2,0)","v":"HARUN SUFAHMI"},"17.12.0045","A","Sama"]
[12,170410,"KETY NOVIANTI",{"$f":"VLOOKUP(E352,Sheet1!$C$2:$D$495,2,0)","v":"KETY NOVIANTI"},"17.12.0044","A","Sama"]
[13,170453,"JERI IHSAN HIDAYATULLOH",{"$f":"VLOOKUP(E353,Sheet1!$C$2:$D$495,2,0)","v":"JERI IHSAN HIDAYATULLOH"},"17.11.0190","A","Sama"]
[14,170435,"NUHGROHO BAHARUDIN PUTRA",{"$f":"VLOOKUP(E354,Sheet1!$C$2:$D$495,2,0)","v":"NUHGROHO BAHARUDIN PUTRA"},"17.11.0146","A","Sama"]
[15,170282,"AYU DISTARIYANI SAPUTRI",{"$f":"VLOOKUP(E355,Sheet1!$C$2:$D$495,2,0)","v":"AYU DISTARIYANI SAPUTRI"},"17.12.0076","A","Sama"]
[18,170428,"GALIH ALAN MADHANI",{"$f":"VLOOKUP(E356,Sheet1!$C$2:$D$495,2,0)","v":"GALIH ALAN MADHANI"},"17.11.0322","A","Sama"]
[19,170430,"RAHMAT HIDAYAT FITRIANTO",{"$f":"VLOOKUP(E357,Sheet1!$C$2:$D$495,2,0)","v":"RAHMAT HIDAYAT FITRIANTO"},"17.11.0169","A","Sama"]
[20,170208,"TEGAR AFIF ASHARI",{"$f":"VLOOKUP(E358,Sheet1!$C$2:$D$495,2,0)","v":"TEGAR AFIF ASHARI"},"17.11.0324","E","Sama"]
[22,170489,"DEMA ABUBAKAR",{"$f":"VLOOKUP(E359,Sheet1!$C$2:$D$495,2,0)","v":"DEMA ABUBAKAR"},"17.11.0223","A","Sama"]
[23,170446,"M ZIDAN NAJMUL FATAH",{"$f":"VLOOKUP(E360,Sheet1!$C$2:$D$495,2,0)","v":"M ZIDAN NAJMUL FATAH"},"17.11.0260","A","Sama"]
[24,170483,"ABI DWI RAFDI",{"$f":"VLOOKUP(E361,Sheet1!$C$2:$D$495,2,0)","v":"ABI DWI RAFDI"},"17.11.0112","A","Sama"]
[25,170468,"DITA AYUNINGTIAS",{"$f":"VLOOKUP(E362,Sheet1!$C$2:$D$495,2,0)","v":"DITA AYUNINGTIAS"},"17.11.0173","A","Sama"]
[26,170436,"IVAN SETYA AZMI",{"$f":"VLOOKUP(E363,Sheet1!$C$2:$D$495,2,0)","v":"IVAN SETYA AZMI"},"17.11.0201","A","Sama"]
[29,170478,"YOGA DWI PRASETYO",{"$f":"VLOOKUP(E364,Sheet1!$C$2:$D$495,2,0)","v":"YOGA DWI PRASETYO"},"17.11.0155","B","Sama"]
[30,170181,"DIDIK WICAKSONO",{"$f":"VLOOKUP(E365,Sheet1!$C$2:$D$495,2,0)","v":"DIDIK WICAKSONO"},"17.11.0136","A","Sama"]
[2,170498,"NUGROHO CHANDRA BUWONO",{"$f":"VLOOKUP(E366,Sheet1!$C$2:$D$495,2,0)","v":"NUGROHO CHANDRA BUWONO"},"17.12.0046","A","Sama"]
[3,170499,"MUHAMAD FAQIH RIDHO",{"$f":"VLOOKUP(E367,Sheet1!$C$2:$D$495,2,0)","v":"MUHAMAD FAQIH RIDHO"},"17.12.0106","A","Sama"]
[4,170484,"EGI CAHYA GUSTI YANA",{"$f":"VLOOKUP(E368,Sheet1!$C$2:$D$495,2,0)","v":"EGI CAHYA GUSTI YANA"},"17.11.0214","A","Sama"]
[5,170402,"NOVIANTO SIDIK PRADANA",{"$f":"VLOOKUP(E369,Sheet1!$C$2:$D$495,2,0)","v":"NOVIANTO SIDIK PRADANA"},"17.11.0118","A","Sama"]
[6,170512,"DANANG RIKIYANTO",{"$f":"VLOOKUP(E370,Sheet1!$C$2:$D$495,2,0)","v":"DANANG RIKIYANTO"},"17.11.0171","A","Sama"]
[8,170466,"FERDINAND NYOMAN DHANDI SETYAWAN",{"$f":"VLOOKUP(E371,Sheet1!$C$2:$D$495,2,0)","v":"FERDINAND NYOMAN DHANDI SETYAWAN"},"17.11.0166","A","Sama"]
[9,170437,"ROY KRISNA PRATAMA",{"$f":"VLOOKUP(E372,Sheet1!$C$2:$D$495,2,0)","v":"ROY KRISNA PRATAMA"},"17.12.0074","E","Sama"]
[10,170481,"CHANIF FAUZI",{"$f":"VLOOKUP(E373,Sheet1!$C$2:$D$495,2,0)","v":"CHANIF FAUZI"},"17.11.0141","A","Sama"]
[11,170470,"CYNTHIA SILVIANA WIJAYANTI",{"$f":"VLOOKUP(E374,Sheet1!$C$2:$D$495,2,0)","v":"CYNTHIA SILVIANA WIJAYANTI"},"17.11.0174","A","Sama"]
[13,170409,"AMELIA PUTRIYANI",{"$f":"VLOOKUP(E375,Sheet1!$C$2:$D$495,2,0)","v":"AMELIA PUTRIYANI"},"17.12.0118","B","Sama"]
[15,170157,"MUHAMMAD RIFAI",{"$f":"VLOOKUP(E376,Sheet1!$C$2:$D$495,2,0)","v":"MUHAMMAD RIFAI"},"17.11.0279","A","Sama"]
[16,170491,"AL HAFIDZ HANIFAN ISLAHI",{"$f":"VLOOKUP(E377,Sheet1!$C$2:$D$495,2,0)","v":"AL HAFIDZ HANIFAN ISLAHI"},"17.11.0175","A","Sama"]
[17,170492,"MUHAMMAD ILHAM HANAFI",{"$f":"VLOOKUP(E378,Sheet1!$C$2:$D$495,2,0)","v":"MUHAMMAD ILHAM HANAFI"},"17.11.0199","A","Sama"]
[18,170488,"MUHAMMAD RIFKI UBAEDILLAH",{"$f":"VLOOKUP(E379,Sheet1!$C$2:$D$495,2,0)","v":"MUHAMMAD RIFKI UBAEDILLAH"},"17.11.0281","A","Sama"]
[19,170501,"TEGUH BUDI SANTOSO",{"$f":"VLOOKUP(E380,Sheet1!$C$2:$D$495,2,0)","v":"TEGUH BUDI SANTOSO"},"17.11.0161","E","Sama"]
[20,170500,"JULIO BHAGASKARA ADIPRADANA",{"$f":"VLOOKUP(E381,Sheet1!$C$2:$D$495,2,0)","v":"JULIO BHAGASKARA ADIPRADANA"},"17.11.0282","A","Sama"]
[21,170477,"SUSI SULISTYANINGSIH",{"$f":"VLOOKUP(E382,Sheet1!$C$2:$D$495,2,0)","v":"SUSI SULISTYANINGSIH"},"17.11.0283","A","Sama"]
[23,170471,"ADAM AGENG WIJAYA",{"$f":"VLOOKUP(E383,Sheet1!$C$2:$D$495,2,0)","v":"ADAM AGENG WIJAYA"},"17.12.0057","A","Sama"]
[24,170467,"ENGGAR PRI PAMBUDI",{"$f":"VLOOKUP(E384,Sheet1!$C$2:$D$495,2,0)","v":"ENGGAR PRI PAMBUDI"},"17.11.0121","A","Sama"]
[25,170529,"ISMU IRAWAN",{"$f":"VLOOKUP(E385,Sheet1!$C$2:$D$495,2,0)","v":"ISMU IRAWAN"},"17.11.0120","A","Sama"]
[26,170485,"RULI ANDRESTA",{"$f":"VLOOKUP(E386,Sheet1!$C$2:$D$495,2,0)","v":"RULI ANDRESTA"},"17.11.0284","A",{"$f":"IF(C386=D386,\"Sama\",\"Tidak\")","v":"Sama"}]
[27,170460,"ANISA NUR FAIZAH",{"$f":"VLOOKUP(E387,Sheet1!$C$2:$D$495,2,0)","v":"ANISA NUR FAIZAH"},"17.12.0082","A","Sama"]
[30,170465,"MALDI SAVARA HIDAYAT",{"$f":"VLOOKUP(E388,Sheet1!$C$2:$D$495,2,0)","v":"MALDI SAVARA HIDAYAT"},"17.12.0112","A","Sama"]
[31,170452,"NAAN DAYUNA",{"$f":"VLOOKUP(E389,Sheet1!$C$2:$D$495,2,0)","v":"NAAN DAYUNA"},"17.12.0114","A","Sama"]
[32,170450,"IRFAN FATKHURROHMAN",{"$f":"VLOOKUP(E390,Sheet1!$C$2:$D$495,2,0)","v":"IRFAN FATKHURROHMAN"},"17.12.0055","B","Sama"]
[33,170530,"YULIAN AJRI ARDIANSYAH",{"$f":"VLOOKUP(E391,Sheet1!$C$2:$D$495,2,0)","v":"YULIAN AJRI ARDIANSYAH"},"17.11.0143","A","Sama"]
[34,170461,"FAUZI TRI HIDAYAT",{"$f":"VLOOKUP(E392,Sheet1!$C$2:$D$495,2,0)","v":"FAUZI TRI HIDAYAT"},"17.11.0285","A","Sama"]
[36,170412,"RUDI ADITYA",{"$f":"VLOOKUP(E393,Sheet1!$C$2:$D$495,2,0)","v":"RUDI ADITYA"},"17.12.0043","A","Sama"]
[1,170389,"ALFIAN WIDY REKSA",{"$f":"VLOOKUP(E394,Sheet1!$C$2:$D$495,2,0)","v":"ALFIAN WIDY REKSA"},"17.11.0236","A","Sama"]
[2,170544,"FAIZAL AMIN",{"$f":"VLOOKUP(E395,Sheet1!$C$2:$D$495,2,0)","v":"FAIZAL AMIN"},"17.12.0066","A","Sama"]
[4,170522,"INDIKA MANGGALA PUTRA",{"$f":"VLOOKUP(E396,Sheet1!$C$2:$D$495,2,0)","v":"INDIKA MANGGALA PUTRA"},"17.12.0140","C","Sama"]
[5,170525,"MOHAMAD AIFAN DWI WIYATAMA ANDRIAN",{"$f":"VLOOKUP(E397,Sheet1!$C$2:$D$495,2,0)","v":"MOHAMAD AIFAN DWI WIYATAMA ANDRIAN"},"17.12.0083","A","Sama"]
[6,170550,"ABU RIZAL RAFSANJANI",{"$f":"VLOOKUP(E398,Sheet1!$C$2:$D$495,2,0)","v":"ABU RIZAL RAFSANJANI"},"17.11.0213","A","Sama"]
[7,170487,"RUDI AGUS PRAPTOMO",{"$f":"VLOOKUP(E399,Sheet1!$C$2:$D$495,2,0)","v":"RUDI AGUS PRAPTOMO"},"17.12.0131","A","Sama"]
[8,170420,"MAULUDIA PANJI YULIANSAH",{"$f":"VLOOKUP(E400,Sheet1!$C$2:$D$495,2,0)","v":"MAULUDIA PANJI YULIANSAH"},"17.11.0277","A","Sama"]
[9,170496,"HELMI FAKHRUDDIN",{"$f":"VLOOKUP(E401,Sheet1!$C$2:$D$495,2,0)","v":"HELMI FAKHRUDDIN"},"17.11.0195","A","Sama"]
[10,170495,"WAHYU ANANG SUBEKTI",{"$f":"VLOOKUP(E402,Sheet1!$C$2:$D$495,2,0)","v":"WAHYU ANANG SUBEKTI"},"17.12.0104","A","Sama"]
[13,170403,"EDI RIANTO",{"$f":"VLOOKUP(E403,Sheet1!$C$2:$D$495,2,0)","v":"EDI RIANTO"},"17.12.0164","A","Sama"]
[14,170408,"ABI YOGA TAMPOMO",{"$f":"VLOOKUP(E404,Sheet1!$C$2:$D$495,2,0)","v":"ABI YOGA TAMPOMO"},"17.11.0178","A","Sama"]
[15,170386,"DIKA NOER MUHAMAD FATAH",{"$f":"VLOOKUP(E405,Sheet1!$C$2:$D$495,2,0)","v":"DIKA NOER MUHAMAD FATAH"},"17.12.0094","A","Sama"]
[16,170419,"WILUJENG PURNOMO ANGKADI",{"$f":"VLOOKUP(E406,Sheet1!$C$2:$D$495,2,0)","v":"WILUJENG PURNOMO ANGKADI"},"17.12.0173","C","Sama"]
[18,170382,"LUTFI YUDA RAMADHAN",{"$f":"VLOOKUP(E407,Sheet1!$C$2:$D$495,2,0)","v":"LUTFI YUDA RAMADHAN"},"17.11.0275","A","Sama"]
[19,170390,"ANGGA FERDIYANTO",{"$f":"VLOOKUP(E408,Sheet1!$C$2:$D$495,2,0)","v":"ANGGA FERDIYANTO"},"17.11.0127","A","Sama"]
[21,170387,"M SULKHAN TAMA RAMDHANI",{"$f":"VLOOKUP(E409,Sheet1!$C$2:$D$495,2,0)","v":"M SULKHAN TAMA RAMDHANI"},"17.11.0206","A","Sama"]
[22,170433,"LU'AI NUR FIRDAUS",{"$f":"VLOOKUP(E410,Sheet1!$C$2:$D$495,2,0)","v":"LU'AI NUR FIRDAUS"},"17.11.0109","A","Sama"]
[23,170432,"MUHAMAD ABDUL MUFIDZ",{"$f":"VLOOKUP(E411,Sheet1!$C$2:$D$495,2,0)","v":"MUHAMAD ABDUL MUFIDZ"},"17.11.0106","A","Sama"]
[24,170411,"SEKAR ANDINI",{"$f":"VLOOKUP(E412,Sheet1!$C$2:$D$495,2,0)","v":"SEKAR ANDINI"},"17.12.0042","A","Sama"]
[25,170441,"TATA SALANJAR GUSTINADI",{"$f":"VLOOKUP(E413,Sheet1!$C$2:$D$495,2,0)","v":"TATA SALANJAR GUSTINADI"},"17.12.0172","A","Sama"]
[28,170385,"EKA SUCI NOPIE HANTARI",{"$f":"VLOOKUP(E414,Sheet1!$C$2:$D$495,2,0)","v":"EKA SUCI NOPIE HANTARI"},"17.11.0145","A","Sama"]
[29,170511,"ADIL AMRULLAH",{"$f":"VLOOKUP(E415,Sheet1!$C$2:$D$495,2,0)","v":"ADIL AMRULLAH"},"17.11.0128","E","Sama"]
[1,170536,"MOH FADLIL FAQIH",{"$f":"VLOOKUP(E416,Sheet1!$C$2:$D$495,2,0)","v":"MOH FADLIL FAQIH"},"17.11.0189","A","Sama"]
[2,170534,"REGGY BOWO LEKSANA",{"$f":"VLOOKUP(E417,Sheet1!$C$2:$D$495,2,0)","v":"REGGY BOWO LEKSANA"},"17.12.0079","A","Sama"]
[3,170541,"ABDUL GOFUR",{"$f":"VLOOKUP(E418,Sheet1!$C$2:$D$495,2,0)","v":"ABDUL GOFUR"},"17.12.0090","A","Sama"]
[4,170231,"RAEZA YUTHA TRIYUNDI",{"$f":"VLOOKUP(E419,Sheet1!$C$2:$D$495,2,0)","v":"RAEZA YUTHA TRIYUNDI"},"17.11.0329","A","Sama"]
[5,170516,"IRAWAN BAROKAH",{"$f":"VLOOKUP(E420,Sheet1!$C$2:$D$495,2,0)","v":"IRAWAN BAROKAH"},"17.11.0198","A","Sama"]
[6,170388,"UGA SYAHRIL RAMADHAN",{"$f":"VLOOKUP(E421,Sheet1!$C$2:$D$495,2,0)","v":"UGA SYAHRIL RAMADHAN"},"17.12.0150","A","Sama"]
[7,170374,"INDRA ALAN NUGROHO",{"$f":"VLOOKUP(E422,Sheet1!$C$2:$D$495,2,0)","v":"INDRA ALAN NUGROHO"},"17.11.0181","A","Sama"]
[8,170535,"ERADIKA REZA LUTFIANSYAH",{"$f":"VLOOKUP(E423,Sheet1!$C$2:$D$495,2,0)","v":"ERADIKA REZA LUTFIANSYAH"},"17.12.0120","A","Sama"]
[9,170546,"WAHYU PRASETYO",{"$f":"VLOOKUP(E424,Sheet1!$C$2:$D$495,2,0)","v":"WAHYU PRASETYO"},"17.11.0185","A","Sama"]
[10,170517,"HASTIWI AMELIA NURAWALIAH",{"$f":"VLOOKUP(E425,Sheet1!$C$2:$D$495,2,0)","v":"HASTIWI AMELIA NURAWALIAH"},"17.12.0078","A","Sama"]
[11,170513,"ERICK SETIO PAMUJI",{"$f":"VLOOKUP(E426,Sheet1!$C$2:$D$495,2,0)","v":"ERICK SETIO PAMUJI"},"17.11.0182","A","Sama"]
[12,170540,"KELLY DHINA ARYANITA",{"$f":"VLOOKUP(E427,Sheet1!$C$2:$D$495,2,0)","v":"KELLY DHINA ARYANITA"},"17.12.0091","A","Sama"]
[14,170543,"GALIH AHMAD ZAKIA RAMADHAN",{"$f":"VLOOKUP(E428,Sheet1!$C$2:$D$495,2,0)","v":"GALIH AHMAD ZAKIA RAMADHAN"},"17.11.0203","A","Sama"]
[15,170456,"FAISAL FAUZI",{"$f":"VLOOKUP(E429,Sheet1!$C$2:$D$495,2,0)","v":"FAISAL FAUZI"},"17.12.0053","A","Sama"]
[16,170538,"RESTU LALIN PUTRA SATRIA",{"$f":"VLOOKUP(E430,Sheet1!$C$2:$D$495,2,0)","v":"RESTU LALIN PUTRA SATRIA"},"17.11.0129","A","Sama"]
[17,170523,"ADIMAS SYAFI'I",{"$f":"VLOOKUP(E431,Sheet1!$C$2:$D$495,2,0)","v":"ADIMAS SYAFI'I"},"17.11.0140","A","Sama"]
[18,170557,"NUR ACHMAD MUKTI AZIZ",{"$f":"VLOOKUP(E432,Sheet1!$C$2:$D$495,2,0)","v":"NUR ACHMAD MUKTI AZIZ"},"17.11.0132","A","Sama"]
[19,170562,"RYAN ARYANDI",{"$f":"VLOOKUP(E433,Sheet1!$C$2:$D$495,2,0)","v":"RYAN ARYANDI"},"17.12.0084","A","Sama"]
[21,170578,"AFIF ANDI NUR AGAZI",{"$f":"VLOOKUP(E434,Sheet1!$C$2:$D$495,2,0)","v":"AFIF ANDI NUR AGAZI"},"17.11.0134","A","Sama"]
[22,170482,"FAHMI REZA SAHPUTRA",{"$f":"VLOOKUP(E435,Sheet1!$C$2:$D$495,2,0)","v":"FAHMI REZA SAHPUTRA"},"17.11.0133","A","Sama"]
[23,170384,"IRFAN RIFAI AZIZ",{"$f":"VLOOKUP(E436,Sheet1!$C$2:$D$495,2,0)","v":"IRFAN RIFAI AZIZ"},"17.11.0085","A","Sama"]
[24,170490,"WAHYU WIDIANTO",{"$f":"VLOOKUP(E437,Sheet1!$C$2:$D$495,2,0)","v":"WAHYU WIDIANTO"},"17.11.0219","A","Sama"]
[25,170537,"PANJI IRAWAN",{"$f":"VLOOKUP(E438,Sheet1!$C$2:$D$495,2,0)","v":"PANJI IRAWAN"},"17.11.0184","A","Sama"]
[27,170568,"JUNIAR IMANDANNI WIDODO",{"$f":"VLOOKUP(E439,Sheet1!$C$2:$D$495,2,0)","v":"JUNIAR IMANDANNI WIDODO"},"17.11.0310","A","Sama"]
[28,170549,"BRAM PRADANA MARDA",{"$f":"VLOOKUP(E440,Sheet1!$C$2:$D$495,2,0)","v":"BRAM PRADANA MARDA"},"17.11.0294","A","Sama"]
[29,170556,"FAISAL LUTFI HAKIM",{"$f":"VLOOKUP(E441,Sheet1!$C$2:$D$495,2,0)","v":"FAISAL LUTFI HAKIM"},"17.11.0192","A","Sama"]
[30,170554,"WAHYU RAMDANI",{"$f":"VLOOKUP(E442,Sheet1!$C$2:$D$495,2,0)","v":"WAHYU RAMDANI"},"17.11.0301","A","Sama"]
[31,170473,"FARINDA EKA PUTRI",{"$f":"VLOOKUP(E443,Sheet1!$C$2:$D$495,2,0)","v":"FARINDA EKA PUTRI"},"17.12.0146","A","Sama"]
[32,170555,"RAHMAWAN AFIANTO SAPUTRO",{"$f":"VLOOKUP(E444,Sheet1!$C$2:$D$495,2,0)","v":"RAHMAWAN AFIANTO SAPUTRO"},"17.11.0278","A","Sama"]
[34,170212,"IHWAN PRASETIO",{"$f":"VLOOKUP(E445,Sheet1!$C$2:$D$495,2,0)","v":"IHWAN PRASETIO"},"17.11.0052","A","Sama"]
[36,170621,"MUHAMAD ALIF ALFARIZKI",{"$f":"VLOOKUP(E446,Sheet1!$C$2:$D$495,2,0)","v":"MUHAMAD ALIF ALFARIZKI"},"17.12.0133","A","Sama"]
[41,170269,"KURNIA HANDARA",{"$f":"VLOOKUP(E447,Sheet1!$C$2:$D$495,2,0)","v":"KURNIA HANDARA"},"17.11.0154","A","Sama"]
[42,170518,"NAILIS SYAFI'AH",{"$f":"VLOOKUP(E448,Sheet1!$C$2:$D$495,2,0)","v":"NAILIS SYAFI'AH"},"17.12.0080","A","Sama"]
[43,170511,"ADIL AMRULLAH",{"$f":"VLOOKUP(E449,Sheet1!$C$2:$D$495,2,0)","v":"ADIL AMRULLAH"},"17.11.0128","A","Sama"]
[44,170522,"INDIKA MANGGALA PUTRA",{"$f":"VLOOKUP(E450,Sheet1!$C$2:$D$495,2,0)","v":"INDIKA MANGGALA PUTRA"},"17.12.0140","A",{"$f":"IF(C450=D450,\"Sama\",\"Tidak\")","v":"Sama"}]
[47,170651,"WIRA SAKTI AKBAR RIYADI",{"$f":"VLOOKUP(E451,Sheet1!$C$2:$D$495,2,0)","v":"WIRA SAKTI AKBAR RIYADI"},"17.11.0234","A","Sama"]
[48,170631,"IMAM KHADAFI",{"$f":"VLOOKUP(E452,Sheet1!$C$2:$D$495,2,0)","v":"IMAM KHADAFI"},"17.12.0171","A","Sama"]
[50,170654,"HERI RAMADHAN",{"$f":"VLOOKUP(E453,Sheet1!$C$2:$D$495,2,0)","v":"HERI RAMADHAN"},"17.11.0230","A","Sama"]
[2,170559,"FARIZ KHABIB IBROHIM",{"$f":"VLOOKUP(E454,Sheet1!$C$2:$D$495,2,0)","v":"FARIZ KHABIB IBROHIM"},"17.12.0051","A","Sama"]
[6,170502,"MUFLIH DZULFIAN",{"$f":"VLOOKUP(E455,Sheet1!$C$2:$D$495,2,0)","v":"MUFLIH DZULFIAN"},"17.11.0209","A","Sama"]
[8,170569,"MOHAMAD FAISAL",{"$f":"VLOOKUP(E456,Sheet1!$C$2:$D$495,2,0)","v":"MOHAMAD FAISAL"},"17.12.0097","A","Sama"]
[9,170566,"RIZAL SYUKRON NUGROHO",{"$f":"VLOOKUP(E457,Sheet1!$C$2:$D$495,2,0)","v":"RIZAL SYUKRON NUGROHO"},"17.11.0220","A","Sama"]
[10,170451,"TEGAR DWI RAMADHAN",{"$f":"VLOOKUP(E458,Sheet1!$C$2:$D$495,2,0)","v":"TEGAR DWI RAMADHAN"},"17.12.0061","A","Sama"]
[11,170560,"BINTARI HIDAYANTI",{"$f":"VLOOKUP(E459,Sheet1!$C$2:$D$495,2,0)","v":"BINTARI HIDAYANTI"},"17.11.0269","A","Sama"]
[13,170366,"SINGGIH SYAFRIZAL",{"$f":"VLOOKUP(E460,Sheet1!$C$2:$D$495,2,0)","v":"SINGGIH SYAFRIZAL"},"17.11.0304","A","Sama"]
[14,170472,"VITA LISTIA ANDANI",{"$f":"VLOOKUP(E461,Sheet1!$C$2:$D$495,2,0)","v":"VITA LISTIA ANDANI"},"17.12.0088","A","Sama"]
[16,170189,"ANISA UMMUL LATIFAH",{"$f":"VLOOKUP(E462,Sheet1!$C$2:$D$495,2,0)","v":"ANISA UMMUL LATIFAH"},"17.12.0159","A","Sama"]
[17,170558,"SEPTIAN ILHAM SANTOSA",{"$f":"VLOOKUP(E463,Sheet1!$C$2:$D$495,2,0)","v":"SEPTIAN ILHAM SANTOSA"},"17.12.0087","A","Sama"]
[18,170345,"MUHAMMAD RAHMAT HADIYAMIN",{"$f":"VLOOKUP(E464,Sheet1!$C$2:$D$495,2,0)","v":"MUHAMMAD RAHMAT HADIYAMIN"},"17.11.0147","A","Sama"]
[19,170328,"LUSY RAHMAWAN PANGESTU",{"$f":"VLOOKUP(E465,Sheet1!$C$2:$D$495,2,0)","v":"LUSY RAHMAWAN PANGESTU"},"17.12.0054","A","Sama"]
[20,170594,"WILLY RUBY OKTAVIANUS",{"$f":"VLOOKUP(E466,Sheet1!$C$2:$D$495,2,0)","v":"WILLY RUBY OKTAVIANUS"},"17.11.0295","A","Sama"]
[21,170561,"MUJIBUROKHMAN",{"$f":"VLOOKUP(E467,Sheet1!$C$2:$D$495,2,0)","v":"MUJIBUROKHMAN"},"17.12.0163","A","Sama"]
[22,170545,"TEGAR PAMBUDI",{"$f":"VLOOKUP(E468,Sheet1!$C$2:$D$495,2,0)","v":"TEGAR PAMBUDI"},"17.11.0241","A","Sama"]
[25,170622,"ABDURRAHMAN AL GHOFIQI",{"$f":"VLOOKUP(E469,Sheet1!$C$2:$D$495,2,0)","v":"ABDURRAHMAN AL GHOFIQI"},"17.11.0231","A","Sama"]
[26,170630,"MUSLIM ADILAH",{"$f":"VLOOKUP(E470,Sheet1!$C$2:$D$495,2,0)","v":"MUSLIM ADILAH"},"17.12.0144","A","Sama"]
[28,170626,"ASRIL FAUZI NURHAKIM",{"$f":"VLOOKUP(E471,Sheet1!$C$2:$D$495,2,0)","v":"ASRIL FAUZI NURHAKIM"},"17.12.0119","A","Sama"]
[31,170539,"NELLY REGINA SUSANTI",{"$f":"VLOOKUP(E472,Sheet1!$C$2:$D$495,2,0)","v":"NELLY REGINA SUSANTI"},"17.11.0330","A","Sama"]
[34,170642,"MARWAN SETIANGGORO",{"$f":"VLOOKUP(E473,Sheet1!$C$2:$D$495,2,0)","v":"MARWAN SETIANGGORO"},"17.12.0167","A","Sama"]
[35,170625,"PAMUNGKAS CATUR NUGROHO",{"$f":"VLOOKUP(E474,Sheet1!$C$2:$D$495,2,0)","v":"PAMUNGKAS CATUR NUGROHO"},"17.11.0327","A","Sama"]
[1,170583,"DINA FAJAR SULISTIYANI",{"$f":"VLOOKUP(E475,Sheet1!$C$2:$D$495,2,0)","v":"DINA FAJAR SULISTIYANI"},"17.11.0149","A","Sama"]
[2,170582,"ZEZYA RAMADHANY KHARISMA MURTI",{"$f":"VLOOKUP(E476,Sheet1!$C$2:$D$495,2,0)","v":"ZEZYA RAMADHANY KHARISMA MURTI"},"17.12.0052","A","Sama"]
[5,170429,"MANUT SUTRISNO",{"$f":"VLOOKUP(E477,Sheet1!$C$2:$D$495,2,0)","v":"MANUT SUTRISNO"},"17.11.0264","A","Sama"]
[8,170586,"NADILLA PUTRI UTAMI",{"$f":"VLOOKUP(E478,Sheet1!$C$2:$D$495,2,0)","v":"NADILLA PUTRI UTAMI"},"17.12.0059","A","Sama"]
[10,170565,"SISKA PUTRI UTAMI",{"$f":"VLOOKUP(E479,Sheet1!$C$2:$D$495,2,0)","v":"SISKA PUTRI UTAMI"},"17.12.0095","A","Sama"]
[11,170542,"NAELLA FAUZIATUL ABSONI",{"$f":"VLOOKUP(E480,Sheet1!$C$2:$D$495,2,0)","v":"NAELLA FAUZIATUL ABSONI"},"17.12.0151","A","Sama"]
[13,170600,"AZIZ REZA DWITAMA",{"$f":"VLOOKUP(E481,Sheet1!$C$2:$D$495,2,0)","v":"AZIZ REZA DWITAMA"},"17.11.0212","A","Sama"]
[15,170601,"FIKRI ADI SUSENO",{"$f":"VLOOKUP(E482,Sheet1!$C$2:$D$495,2,0)","v":"FIKRI ADI SUSENO"},"17.11.0303","A","Sama"]
[16,170602,"DEADRA IVANKA NAILUFAR",{"$f":"VLOOKUP(E483,Sheet1!$C$2:$D$495,2,0)","v":"DEADRA IVANKA NAILUFAR"},"17.12.0092","A","Sama"]
[17,170501,"TEGUH BUDI SANTOSO",{"$f":"VLOOKUP(E484,Sheet1!$C$2:$D$495,2,0)","v":"TEGUH BUDI SANTOSO"},"17.11.0161","A","Sama"]
[18,170615,"IDA LAENI",{"$f":"VLOOKUP(E485,Sheet1!$C$2:$D$495,2,0)","v":"IDA LAENI"},"17.12.0147","A","Sama"]
[20,170567,"HANENDYO ANDHI GURITA",{"$f":"VLOOKUP(E486,Sheet1!$C$2:$D$495,2,0)","v":"HANENDYO ANDHI GURITA"},"17.11.0207","A","Sama"]
[21,170603,"RIZKY YOGA PANGESTU",{"$f":"VLOOKUP(E487,Sheet1!$C$2:$D$495,2,0)","v":"RIZKY YOGA PANGESTU"},"17.11.0204","A","Sama"]
[22,170612,"AJI PANGESTU",{"$f":"VLOOKUP(E488,Sheet1!$C$2:$D$495,2,0)","v":"AJI PANGESTU"},"17.12.0113","A","Sama"]
[23,170620,"SYAFIQ FEBRI PANGESTUNING TYAS",{"$f":"VLOOKUP(E489,Sheet1!$C$2:$D$495,2,0)","v":"SYAFIQ FEBRI PANGESTUNING TYAS"},"17.12.0070","A","Sama"]
[24,170599,"CARELL YUDHI HERNANI",{"$f":"VLOOKUP(E490,Sheet1!$C$2:$D$495,2,0)","v":"CARELL YUDHI HERNANI"},"17.12.0069","A","Sama"]
[25,170604,"NICO CESAR ARYANTO PRIMADANA",{"$f":"VLOOKUP(E491,Sheet1!$C$2:$D$495,2,0)","v":"NICO CESAR ARYANTO PRIMADANA"},"17.12.0075","A","Sama"]
[26,170581,"DEWI PUPUT SAPUTRI",{"$f":"VLOOKUP(E492,Sheet1!$C$2:$D$495,2,0)","v":"DEWI PUPUT SAPUTRI"},"17.11.0266","A","Sama"]
[27,170352,"RIYANA INDAH CAHYANI",{"$f":"VLOOKUP(E493,Sheet1!$C$2:$D$495,2,0)","v":"RIYANA INDAH CAHYANI"},"17.11.0340","A","Sama"]
[30,170469,"DEPPI PUSPITASARI",{"$f":"VLOOKUP(E494,Sheet1!$C$2:$D$495,2,0)","v":"DEPPI PUSPITASARI"},"17.12.0096","A","Sama"]
[32,170616,"NUR AULIA RAHMAWATI",{"$f":"VLOOKUP(E495,Sheet1!$C$2:$D$495,2,0)","v":"NUR AULIA RAHMAWATI"},"17.11.0265","A","Sama"]
[34,170505,"BAGAS SURYATAMA",{"$f":"VLOOKUP(E496,Sheet1!$C$2:$D$495,2,0)","v":"BAGAS SURYATAMA"},"17.11.0125","A","Sama"]
[37,170644,"MOHAMMAD SYIFA RAMADHAN",{"$f":"VLOOKUP(E497,Sheet1!$C$2:$D$495,2,0)","v":"MOHAMMAD SYIFA RAMADHAN"},"17.11.0296","A","Sama"]
[39,170648,"BAYU SETIA AJI",{"$f":"VLOOKUP(E498,Sheet1!$C$2:$D$495,2,0)","v":"BAYU SETIA AJI"},"17.11.0239","A","Sama"]
[35,170022,"SUSANTO",{"$f":"VLOOKUP(E499,Sheet1!$C$2:$D$495,2,0)","v":"SUSANTO"},"17.11.0009","A","Sama"]
[16,170168,"DEWI SULISTYOWATI",{"$f":"VLOOKUP(E500,Sheet1!$C$2:$D$495,2,0)","v":"DEWI SULISTYOWATI"},"17.12.0154","D","Sama"]
[33,170136,"ALDI SETIA PAMBUDI",{"$f":"VLOOKUP(E501,Sheet1!$C$2:$D$495,2,0)","v":"ALDI SETIA PAMBUDI"},"17.11.0057","A","Sama"]
[21,170221,"TITIN MEISAROH",{"$f":"VLOOKUP(E502,Sheet1!$C$2:$D$495,2,0)","v":"TITIN MEISAROH"},"17.12.0038","A","Sama"]
[22,170373,"HABIBBULLOH ROSYID RIDHO UMARSUM MANSYUR SYAH",{"$f":"VLOOKUP(E503,Sheet1!$C$2:$D$495,2,0)","v":"HABIBBULLOH ROSYID RIDHO UMARSUM MANSYUR SYAH"},"17.12.0160","A","Sama"]
[17,170424,"AGUNG SAPUTRA",{"$f":"VLOOKUP(E504,Sheet1!$C$2:$D$495,2,0)","v":"AGUNG SAPUTRA"},"17.11.0224","A","Sama"]
[1,170373,"HABIBBULLOH ROSYID RIDHO UMARSUM MANSYUR SYAH",{"$f":"VLOOKUP(E505,Sheet1!$C$2:$D$495,2,0)","v":"HABIBBULLOH ROSYID RIDHO UMARSUM MANSYUR SYAH"},"17.12.0160","A","Sama"]
[19,170594,"VERA CINDI MONARIKE",{"$f":"VLOOKUP(E506,Sheet1!$C$2:$D$495,2,0)","v":"VERA CINDI MONARIKE"},"17.12.0064","A","Sama"]
[29,170141,"SONY GUNAWAN ZEN","SONY GUNAWAN ZEN","17.11.0059","A","Sama"]
[27,170160,"ADE TRIO PAMUNGKAS","ADE TRIO PAMUNGKAS","17.11.0308","D","Sama"]
[13,170322,"EVI SINDYANTI","EVI SINDYANTI","17.12.0149","A","Sama"]
[7,170228,"AKHDAN RAHMI HANIF","AKHDAN RAHMI HANIF","17.11.0221","A","Sama"]
[22,170280,"MA'RUF MAFTUKHIN","MA'RUF MAFTUKHIN","17.12.0073","A","Sama"]
[23,170367,"RINGO ADAM B.A","RINGO ADAM B.A","17.12.0168","B","Sama"]
[4,170379,"GHIFARI IDHAM SATRIA NASUTION","GHIFARI IDHAM SATRIA NASUTION","17.11.0259","A","Sama"]
[1,170398,"ALFAN RIZKY LUTFIANTO","ALFAN RIZKY LUTFIANTO","17.11.0317","A","Sama"]
[27,170434,"FARHAN BANI RIZKI","FARHAN BANI RIZKI","17.11.0108","A","Sama"]
[28,170457,"NUR HANIFAH","NUR HANIFAH","17.11.0139","A","Sama"]
[11,170497,"MOCHAMAD RIZAL ASSIDIQ","MOCHAMAD RIZAL ASSIDIQ","17.11.0280","A","Sama"]
[45,170425,"RAKHMAT AGENG YUDHANTO","RAKHMAT AGENG YUDHANTO","17.11.0261","A","Sama"]
[49,170653,"MUH. DANI MUNIF FARIN","MUH. DANI MUNIF FARIN","17.11.0228","A","Sama"]
[4,170380,"FAISHAL ANWAR FADHILLAH","FAISHAL ANWAR FADHILLAH","17.11.0293","A","Sama"]
[23,170506,"NAUFAL MAULANA ANBIYA","NAUFAL MAULANA ANBIYA","17.12.0165","A","Sama"]
[24,170627,"ABI NANDITA  ARGA  APRIA KUSUMA","ABI NANDITA  ARGA  APRIA KUSUMA","17.11.0268","A","Sama"]
[30,170553,"ANIQ VAUQON NAJAH","ANIQ VAUQON NAJAH","17.11.0339","A","Sama"]
[36,170643,"INDAH GHINA SHAFIRA WARDHANY","INDAH GHINA SHAFIRA WARDHANY","17.12.0135","A","Sama"]
[31,170589,"NAUVAL FAHMI ESA SULISTIANA","NAUVAL FAHMI ESA SULISTIANA","17.12.0170","A","Sama"]
[33,170486,"FAIZAL RAMADHAN SUYITNO PUTRA","FAIZAL RAMADHAN SUYITNO PUTRA","17.11.0124","A","Sama"]
[40,170650,"AHMAD ANDRIAN SYAH","AHMAD ANDRIAN SYAH","17.11.0312","A","Sama"]
[6,170380,"FAISHAL ANWAR FADHILLAH ","FAISHAL ANWAR FADHILLAH","17.11.0293","A","Sama"]

{"sheet":"Sheet4","index":4,"n_rows":20,"n_cols":7,"rows_kept":20,"hidden":true}
[20,170161,"TRI SETYARANI DEWI",{"$error":"#N/A"},null,"A",{"$error":"#N/A"}]
[25,170205,"FITA DWI LESTARI",{"$error":"#N/A"},null,"A",{"$error":"#N/A"}]
[12,170313,"LUPITA INDAH FERISKA",{"$error":"#N/A"},null,"D",{"$error":"#N/A"}]
[28,170377,"MUHAMMAD FATIKHUL BIRRI",{"$error":"#N/A"},null,"D",{"$error":"#N/A"}]
[24,170405,"RISKI AHMAD YUSRON",{"$error":"#N/A"},null,"E",{"$error":"#N/A"}]
[14,170463,"RIZKA NUR ROFI'AH",{"$error":"#N/A"},null,"A",{"$error":"#N/A"}]
[20,170375,"MOHAMAD FAIQ NURROHMAN",{"$error":"#N/A"},null,"A",{"$error":"#N/A"}]
[11,170039,"CHINTIA DINI PRATIWI",{"$f":"VLOOKUP(E8,Sheet1!$C$2:$D$495,2,0)","v":{"$error":"#N/A"}},{"$error":"#N/A"},"D",{"$f":"IF(C8=D8,\"Sama\",\"Tidak\")","v":{"$error":"#N/A"}}]
[20,170076,"REFIANTO RIZKY CANDRA S",{"$f":"VLOOKUP(E9,Sheet1!$C$2:$D$495,2,0)","v":{"$error":"#N/A"}},{"$error":"#N/A"},"B",{"$error":"#N/A"}]
[22,170078,"RIZAL RENALDO",{"$f":"VLOOKUP(E10,Sheet1!$C$2:$D$495,2,0)","v":{"$error":"#N/A"}},{"$error":"#N/A"},"D",{"$error":"#N/A"}]
[26,170074,"SUKRON ANASIR",{"$f":"VLOOKUP(E11,Sheet1!$C$2:$D$495,2,0)","v":{"$error":"#N/A"}},{"$error":"#N/A"},"A",{"$error":"#N/A"}]
[20,170097,"LUTHFIYA HATI ISLAMI",{"$f":"VLOOKUP(E12,Sheet1!$C$2:$D$495,2,0)","v":{"$error":"#N/A"}},{"$error":"#N/A"},"B",{"$error":"#N/A"}]
[21,170144,"MEI ANGGUN TRIANA",{"$f":"VLOOKUP(E13,Sheet1!$C$2:$D$495,2,0)","v":{"$error":"#N/A"}},{"$error":"#N/A"},"A",{"$error":"#N/A"}]
[25,170099,"SAKTIANA ARIFFATUN NISA",{"$f":"VLOOKUP(E14,Sheet1!$C$2:$D$495,2,0)","v":{"$error":"#N/A"}},{"$error":"#N/A"},"D",{"$error":"#N/A"}]
[33,170124,"YOGA EKO PUJIANTO",{"$f":"VLOOKUP(E15,Sheet1!$C$2:$D$495,2,0)","v":{"$error":"#N/A"}},{"$error":"#N/A"},"A",{"$error":"#N/A"}]
[36,null,"NOVA PRASETIYO",{"$f":"VLOOKUP(E16,Sheet1!$C$2:$D$495,2,0)","v":{"$error":"#N/A"}},{"$error":"#N/A"},"A",{"$error":"#N/A"}]
[23,170187,"NOVA PRASETIYO",{"$f":"VLOOKUP(E17,Sheet1!$C$2:$D$495,2,0)","v":{"$error":"#N/A"}},{"$error":"#N/A"},"D",{"$error":"#N/A"}]
[33,170311,"AMAR FARICKHIN",{"$f":"VLOOKUP(E18,Sheet1!$C$2:$D$495,2,0)","v":{"$error":"#N/A"}},{"$error":"#N/A"},"D",{"$error":"#N/A"}]
[7,170337,"MENTARI RIZKI EGAYANTI",{"$f":"VLOOKUP(E19,Sheet1!$C$2:$D$495,2,0)","v":{"$error":"#N/A"}},{"$error":"#N/A"},"D",{"$error":"#N/A"}]
[37,"16.11.0288","YOUNGKY RICKY AREIF WIBOWO",{"$f":"VLOOKUP(E20,Sheet1!$C$2:$D$495,2,0)","v":{"$error":"#N/A"}},"16.11.0288","A",{"$error":"#N/A"}]

{"sheet":"26-27","index":5,"n_rows":264,"n_cols":10,"rows_kept":264,"merged":[[0,0,0,3],[0,6,0,9],[1,0,1,3],[1,6,1,9],[2,0,2,3],[2,6,2,9],[3,0,3,3],[3,6,3,9],[5,0,6,0],[5,1,6,1],[5,2,6,2],[5,3,6,3],[5,6,6,6],[5,7,6,7],[5,8,6,8],[5,9,6,9],[61,0,61,3],[61,6,61,9],[62,0,62,3],[62,6,62,9],[63,0,63,3],[63,6,63,9],[64,0,64,3],[64,6,64,9],[66,0,67,0],[66,1,67,1],[66,2,67,2],[66,3,67,3],[66,6,67,6],[66,7,67,7],[66,8,67,8],[66,9,67,9],[102,0,102,3],[102,6,102,9],[103,0,103,3],[103,6,103,9],[104,0,104,3],[104,6,104,9],[105,0,105,3],[105,6,105,9],[107,0,108,0],[107,1,108,1],[107,2,108,2],[107,3,108,3],[107,6,108,6],[107,7,108,7],[107,8,108,8],[107,9,108,9],[143,0,143,3],[143,6,143,9],[144,0,144,3],[144,6,144,9],[145,0,145,3],[145,6,145,9],[146,0,146,3],[146,6,146,9],[148,0,149,0],[148,1,149,1],[148,2,149,2],[148,3,149,3],[148,6,149,6],[148,7,149,7],[148,8,149,8],[148,9,149,9],[184,0,184,3],[184,6,184,9],[185,0,185,3],[185,6,185,9],[186,0,186,3],[186,6,186,9],[187,0,187,3],[187,6,187,9],[189,0,190,0],[189,1,190,1],[189,2,190,2],[189,3,190,3],[189,6,190,6],[189,7,190,7],[189,8,190,8],[189,9,190,9],[225,0,225,3],[225,6,225,9],[226,0,226,3],[226,6,226,9],[227,0,227,3],[227,6,227,9],[228,0,228,3],[228,6,228,9],[230,0,231,0],[230,1,231,1],[230,2,231,2],[230,3,231,3],[230,6,231,6],[230,7,231,7],[230,8,231,8],[230,9,231,9]]}
["KELOMPOK PELATIHAN SUPER UNGGUL (PSU)",{"$nulls":5},"KELOMPOK PELATIHAN SUPER UNGGUL (PSU)"]
["KELOMPOK P.5 ( Ruang AULA )",{"$nulls":5},"KELOMPOK S.5 ( Ruang AULA )"]
["RABU-KAMIS, 26-27 JANUARI 2022",{"$nulls":5},"RABU-KAMIS, 26-27 JANUARI 2022"]
["08.30-12.30 WIB",{"$nulls":5},"13.00-17.00 WIB"]
[]
["NO.","NIM","NAMA","PRODI",null,null,"NO.","NO.DAF","NAMA","PRODI"]
[]
[1,"21SA1007","IQBAL ARIEFTIAN MAULANA","IF",null,null,1,"21SA1016","RIZAL KURNIAWAN","IF"]
[2,"21SA1036","RIKY DIMAS DERMAWAN","IF",null,null,2,"21SA1024","NIKMAH TRINARSIH","IF"]
[3,"21SA1067","M.ABDUL ROHMAN","IF",null,null,3,"21SA1042","NUGROHO MOHAMAD AL AZIZ","IF"]
[4,"21SA1081","TIKA DIANASARI","IF",null,null,4,"21SA1076","FAQIH ROFIQI","IF"]
[5,"21SA1087","SITI NUR VAIZA PEBRIYANTI","IF",null,null,5,"21SA1077","BAGUS AJI PRASETYO","IF"]
[6,"21SA1093","BEMBY MIFTAKHUL FAJRIN","IF",null,null,6,"21SA1099","GUNTUR SETIAWAN","IF"]
[7,"21SA1094","ADEN NUR HIDAYATULLOH","IF",null,null,7,"21SA1100","MUHAMMAD SABILLI AR-RAZIQA","IF"]
[8,"21SA1123","ILHAM PRASETYO","IF",null,null,8,"21SA1110","ULFIATUN KHASANAH","IF"]
[9,"21SA1126","WAHYU IHWANUDIN","IF",null,null,9,"21SA1113","LULU SHAFIRA","IF"]
[10,"21SA1152","KELVIN ADI WIGUNA","IF",null,null,10,"21SA1135","DEBI IRIANTO","IF"]
[11,"21SA1155","MUHAMMAD ARKAN HAFI","IF",null,null,11,"21SA1136","FAIZ NURRAMDANI","IF"]
[12,"21SA1164","RAHMATIA","IF",null,null,12,"21SA1165","TRI ABDUL GHANI","IF"]
[13,"21SA1182","ADITYA PRIMUKTI","IF",null,null,13,"21SA1188","SOIF SOLEH ARIZAL","IF"]
[14,"21SA1204","DWI WAHYU NUGROHO","IF",null,null,14,"21SA1215","ILHAM PRADITHA SATRIAWAN","IF"]
[15,"21SA1238","TAUFIQ RIZKI SOBRINA","IF",null,null,15,"21SA1220","ALDONA SEPTIANA","IF"]
[16,"21SA1240","LATIEF FATKHUR RAHMAN","IF",null,null,16,"21SA1234","ROSY ANNISA GHULFI","IF"]
[17,"21SA1264","NURMA BUDI SANTOSO WIBOWO","IF",null,null,17,"21SA1248","GIAN GUSTIN","IF"]
[18,"21SA1270","RAFIF ZADA PRIYAMBADA","IF",null,null,18,"21SA1251","ADEN HIDAYATULOH","IF"]
[19,"21SA2006","SRI WAHYUNINGSIH","SI",null,null,19,"21SA2016","DEA LILI ANGGRAENI","SI"]
[20,"21SA2009","FARADINA NOVI LAKSHITA","SI",null,null,20,"21SA2018","ANNISA SUCI OCTAVIA","SI"]
[21,"21SA2019","WAHYU PUTRA PRATAMA","SI",null,null,21,"21SA2026","DENI DWI SUSILO","SI"]
[22,"21SA2021","FIRMAN SYAH SETYA BUDI","SI",null,null,22,"21SA2030","ABDILLAH TEGUH PERMANA","SI"]
[23,"21SA2047","LAELA USWATUN HASANAH","SI",null,null,23,"21SA2055","FADHILA INTAN CAHYANINGRUM","SI"]
[24,"21SA2076","RINDIANA PUTRI NATASYA","SI",null,null,24,"21SA2088","SHAFNI NUR HIKMA ROSALIA","SI"]
[25,"21SA2081","MUHAMMAD ASFARI AL-KAROMI","SI",null,null,25,"21SA2101","AHNAF VANNING AL HAQ","SI"]
[26,"21SA2111","EXCEL ERVINTA DESTY","SI",null,null,26,"21SA2117","HASSA LUSIANI SAFITRI","SI"]
[27,"21SA2114","SEKAR AJENG RAMADHANI","SI",null,null,27,"21SA2123","BHARA APRILIAN TUSWANDARU","SI"]
[28,"21SA2138","MUHAMMAD FAUZAN AMIN","SI",null,null,28,"21SA2149","ANZALNA FRESKY GEMPITER SILLHOUTTE","SI"]
[29,"21SA2142","ADITYA PRATAMA","SI",null,null,29,"21SA2154","GHOIS ABDULLAH AKMAL","SI"]
[30,"21SA2155","JESSICA NURANGGITA PUTRI","SI",null,null,30,"21SA3005","HERLAN PRISTANDA NUGRAHA","TI"]
[31,"21SA3001","AL AKBAR JATI BHAGASKARA","TI",null,null,31,"21SA3008","FERDHA ROMADHON","TI"]
[32,"21SA3010","ARMEYTA PUTRI TANZILLA","TI",null,null,32,"21SA3030","FIKRI FIRMANSYAH","TI"]
[33,"21SA3020","VINA PANGGRAITA","TI",null,null,33,"21SA3033","ZAHRAN MUHYIDDIN","TI"]
[34,"21SA3023","AMAL ZAINUN NA'IM","TI",null,null,34,"21SA3044","MAULIDIYA FADILATUL MUNAWWAROH","TI"]
[35,"21SA3046","DWI ANGGA FERDIANTO","TI",null,null,35,"21SA3052","MUHAMMAD FUAD AULIA","TI"]
[36,"21SA3070","GALIH PARLAMBANG YEKTI","TI",null,null,36,"21SA3076","HERI KISWANTO","TI"]
[37,"21SA3093","MUHAMMAD ASARI","TI",null,null,37,"21SA3100","YISLAM RAYYAN","TI"]
[38,"21SB1013","REGAN DAFFA AKMAL AVILA","BD",null,null,38,"21SB1004","ANGGRAINI PUTRI SASIKIRANA","BD"]
[39,"21SB1028","DEBRY ASEVA DWIANTI","BD",null,null,39,"21SB1032","IKO PURNOMO","BD"]
[40,"21SB1059","SINTA NOLYDIA MAEHISA","BD",null,null,40,"21SB1038","RR. GINA KUSUMARDANI","BD"]
[41,"21SB1064","MALIK ABDULLAH KHAIR","BD",null,null,41,"21SB1046","NIA SEFIANI","BD"]
[42,"21SB2005","IHZA GUSTI ADZANI","IK",null,null,42,"21SB2008","NUGROHO ARDHI PRABOWO","IK"]
[43,"21SB2020","HELLEN OKTAVIE ARBANIA","IK",null,null,43,"21SB2019","BAGUS SUSILO","IK"]
[44,"21SB2030","HILMA KARTINI ROHIMAH","IK",null,null,44,"21SB2032","IRMA DWIYANTI","IK"]
[45,"21SB2038","IZZANNUR FATHIN ARFANSYAH","IK",null,null,45,"21SB2041","BRIGITA LAFAZD KEREN NABA DIAN DIRA","IK"]
[46,"21SB2046","JONATHAN FIRMANSYAH","IK",null,null,46,"21SB2054","DIMAS REZA AMRULLAH","IK"]
[47,"21SB2056","MARGARETHA RIZKY SETYAWATI","IK",null,null,47,"21SB2065","PUTRI PAMUNGKAS","IK"]
[48,"21SB2061","REVITA DHIAS SATYA DEWI","IK",null,null,48,"21SB2067","FAUZANI DIKI SATRIA","IK"]
[49,"21SB2089","ARYANDIKA PRATAMA","IK",null,null,49,"21SB2100","ANAN JATI SASONGKO","IK"]
[50,"21SB2091","FITRI AMELIA","IK",null,null,50,"21SB2104","VIONI AVA VELITA AMY","IK"]
[51,"21SB2125","RIZKY SULA","IK",null,null,51,"21SB2139","MELINA PRATAMA PUTRI","IK"]
[52,"21SB2130","ELISTIA WIJAYANTI","IK",null,null,52,"21SB2145","AKHYAR BAHY HANAFI","IK"]
[]
[]
["KELOMPOK PELATIHAN SUPER UNGGUL (PSU)",{"$nulls":5},"KELOMPOK PELATIHAN SUPER UNGGUL (PSU)"]
["KELOMPOK P.6 ( Ruang 2.1 )",{"$nulls":5},"KELOMPOK S.6 ( Ruang 2.1 )"]
["RABU-KAMIS, 26-27 JANUARI 2022",{"$nulls":5},"RABU-KAMIS, 26-27 JANUARI 2022"]
["08.30-12.30 WIB",{"$nulls":5},"13.00-17.00 WIB"]
[]
["NO.","NIM","NAMA","PRODI",null,null,"NO.","NO.DAF","NAMA","PRODI"]
[]
[1,"21SA1008","GILANG TRI KUSUMADANI","IF",null,null,1,"21SA1018","DAFFA IBNU SABILA","IF"]
[2,"21SA1037","HANIF RIZAQI","IF",null,null,2,"21SA1029","PUTRI KARTIKA SARI","IF"]
[3,"21SA1068","HANIF HIDAYATULLOH","IF",null,null,3,"21SA1049","AGUNG RIZKI","IF"]
[4,"21SA1166","AMALIA NUR ISLAMI","IF",null,null,4,"21SA1167","NABIL BESARI YUSUF","IF"]
[5,"21SA1183","ALFIADHI PUTRA","IF",null,null,5,"21SA1190","KHAYATUZ ZAMAN","IF"]
[6,"21SA1206","MOHAMAD NUR SAEAN","IF",null,null,6,"21SA1216","IBNU ROZAK HIDAYATULLOH","IF"]
[7,"21SA1239","DEDE FARHAN","IF",null,null,7,"21SA1227","TIARA PUTRI MAHARANI","IF"]
[8,"21SA1268","AHADIA YOLAND NEVADA","IF",null,null,8,"21SA1250","DWIKI HIDAYAT","IF"]
[9,"21SA2007","JENNY JUNIARLIE JOHAN SURYANI","SI",null,null,9,"21SA2017","OKTAFIA HENG HUICE","SI"]
[10,"21SA2020","DAFA BAYU RAMDANI","SI",null,null,10,"21SA2028","WAKHID SAYUDHA RENDRA GRAHA AL RASHID","SI"]
[11,"21SA2049","PUTRI VIDIA LESTARI","SI",null,null,11,"21SA2056","ASHA NURIL JANNAH","SI"]
[12,"21SA2077","KUSUMAS ASTRI ANGGRAENI","SI",null,null,12,"21SA2089","DWI YULIANA","SI"]
[13,"21SA2084","FIKRI ADITYA PRATAMA","SI",null,null,13,"21SA2102","MAULY CHANDRA GUMILANG","SI"]
[14,"21SA2112","WINI AUDIANA","SI",null,null,14,"21SA2118","LAILATUR ROCHMAH","SI"]
[15,"21SA2139","RAFII NUR AKMAL","SI",null,null,15,"21SA2151","WAHYU DWI PURWOPRASETYO","SI"]
[16,"21SA2163","IKA PUTRI PUSPITA SARI","SI",null,null,16,"21SA3006","IRSAN BAIHAKI","TI"]
[17,"21SA3012","FANY ADELIA MALDA APSARI","TI",null,null,17,"21SA3031","DANIM ALIM MUFTI","TI"]
[18,"21SA3025","DICKY PRASETYA","TI",null,null,18,"21SA3053","ABIYYU RAFI","TI"]
[19,"21SA3047","GILANG CAKHYO MULYO","TI",null,null,19,"21SA3055","NURUL AFIFATUL KHASANAH","TI"]
[20,"21SA3071","ADHIMAS SURYA PRASESA","TI",null,null,20,"21SA3077","YOSUA GUSTI WINAHYU","TI"]
[21,"21SA3094","RASYID SULTHAN AKBAR","TI",null,null,21,"21SA3101","ARGO FAKHRI SAHAR","TI"]
[22,"21SB1015","DIMAS BAGUS SATRIYO","BD",null,null,22,"21SB1006","NEOFANY FEBRIYAN RAHMAWATI","BD"]
[23,"21SB1029","YULIANTI ARBA'ATUN","BD",null,null,23,"21SB1033","SYED FAUZAN ABUBAKAR","BD"]
[24,"21SB1065","MUHAECAL DWI KHATAMI","BD",null,null,24,"21SB1039","ANNISA JULIANA","BD"]
[25,"21SB1068","ANDANI PUSPITASARI","BD",null,null,25,"21SB2012","RAZIN HANIF SAPUTRA","IK"]
[26,"21SB2022","DESKA NUR KHOLIFAH","IK",null,null,26,"21SB2033","AVRILIA RIZKA NUR HIDAYATULLOH","IK"]
[27,"21SB2040","IMAS KHAERUNNI'AM","IK",null,null,27,"21SB2058","YUDISTIRA RAHARJA","IK"]
[28,"21SB2057","HERLINA CHRISTIANA SISWANTO","IK",null,null,28,"21SB2066","ZASKIA NUR EDITRIYA","IK"]
[29,"21SB2090","AUDI RAHMAN","IK",null,null,29,"21SB2101","DAMON LAUDREY MUHAMMAD KEANE HEPHZIBAH","IK"]
[30,"21SB2093","OKTALIAN PRISTIA","IK",null,null,30,"21SB2105","SASKIA APRILIYANI","IK"]
[31,"21SB2131","DIAH INTAN PRAMIESWARI","IK",null,null,31,"21SB2140","FEBRINA RAHMADIANTY","IK"]
[32,"21SB2132","RANGGA AGAS SETIAWAN","IK",null,null,32,"21SB2146","AHMAD ALI IMRON","IK"]
[]
[]
["KELOMPOK PELATIHAN SUPER UNGGUL (PSU)",{"$nulls":5},"KELOMPOK PELATIHAN SUPER UNGGUL (PSU)"]
["KELOMPOK P.7 ( Ruang 2.2 )",{"$nulls":5},"KELOMPOK S.7 ( Ruang 2.2 )"]
["RABU-KAMIS, 26-27 JANUARI 2022",{"$nulls":5},"RABU-KAMIS, 26-27 JANUARI 2022"]
["08.30-12.30 WIB",{"$nulls":5},"13.00-17.00 WIB"]
[]
["NO.","NIM","NAMA","PRODI",null,null,"NO.","NO.DAF","NAMA","PRODI"]
[]
[1,"20SA3108","CHRISTOPHER PRIMA","TI",null,null,1,"21SA1019","RAUL SATRIA","IF"]
[2,"21SA1010","IBRAHIM ADJIE PRADANA","IF",null,null,2,"21SA1043","AITSNAINAWATI DEWI","IF"]
[3,"21SA1038","RAYKHAN RIZQI AL-FADHOL","IF",null,null,3,"21SA1050","ALFID JOKO RUSMONO","IF"]
[4,"21SA1072","DANU ARDIANSYAH","IF",null,null,4,"21SA1078","HANSWARAN FATHUL KHAKIM","IF"]
[5,"21SA1095","USAMAH ABDUL MATIN","IF",null,null,5,"21SA1102","USTON AWALI","IF"]
[6,"21SA1101","KHUSNUL KHOTIMAH","IF",null,null,6,"21SA1118","FITRIANA SALAMAH","IF"]
[7,"21SA1127","HERY ABI NUGROHO","IF",null,null,7,"21SA1137","YUNTAFA ULKHAQ","IF"]
[8,"21SA1159","MARCEL CAHYO PRATAMA","IF",null,null,8,"21SA1168","MUHAMMAD AZKAN MAULANA","IF"]
[9,"21SA1174","DINDA PAVILIA ALFIANSYAH","IF",null,null,9,"21SA1191","TOLIBUL GHUFRON","IF"]
[10,"21SA1184","MOH. TAZRI AFKARUL AMAL","IF",null,null,10,"21SA1218","AZZAH DHIYA ULHAQ","IF"]
[11,"21SA1207","DHIMAS PRAKOSO AJI","IF",null,null,11,"21SA2060","ZULFA UMMU HANI","SI"]
[12,"21SA2050","ARINDIA NUR ZAHRA","SI",null,null,12,"21SA2091","IKA KOMALASARI","SI"]
[13,"21SA2079","INZI FATHIHAH ARRUMAISHA JAHSY","SI",null,null,13,"21SA2119","GILANG SATRIA MAHARDHIKA","SI"]
[14,"21SA2085","UMAR ABDUL ABID","SI",null,null,14,"21SA2120","HANENDA PUTRI ZAMORA","SI"]
[15,"21SA2113","EKA ARDIYA PUTRI","SI",null,null,15,"21SA2152","AFRIZAL FALAH NANDA WARDANI","SI"]
[16,"21SA2140","ADHIM TANFITRA","SI",null,null,16,"21SA3007","CAHYANTA WAHYU RAMADHANI","TI"]
[17,"21SA3013","RIA INDRIYANI","TI",null,null,17,"21SA3032","AGUS PRAMONO","TI"]
[18,"21SA3026","KHAFID ZAILANI","TI",null,null,18,"21SA3054","EGI HIDAYATULLAH","TI"]
[19,"21SA3048","YUSIF EL FAKHRY","TI",null,null,19,"21SA3056","SYIFALITA HIDAWANI","TI"]
[20,"21SA3072","ARDI FIRDAUS NUGRAHA","TI",null,null,20,"21SA3078","ARYA ADI GUNA","TI"]
[21,"21SA3096","JONATHAN FAJAR ARDJUNA HADISISWOYO","TI",null,null,21,"21SA3102","NOGI PRAYOGA","TI"]
[22,"21SB1016","MUHAMAD WAHYU ARIFUDIN","BD",null,null,22,"21SB1008","WIDYA ANINDA NURFITRIYANA","BD"]
[23,"21SB1030","LINDA SULISTIAWATI","BD",null,null,23,"21SB1034","ALFIAN FATHAH BAEHAQI","BD"]
[24,"21SB1066","ABDURRAHMAN","BD",null,null,24,"21SB1043","RIZKY WIDI ARDHIANY","BD"]
[25,"21SB2001","MUHAMMAD GILANG ALFADINAR","IK",null,null,25,"21SB2013","MUHAMMAD ALDRIAN SYAFA","IK"]
[26,"21SB2026","AGNES MEA ROSALIA PUTRI PRANANTYAS","IK",null,null,26,"21SB2034","DHEA CANDRA AGISTA","IK"]
[27,"21SB2042","SANDHY AFRIZAL ROPENDHY","IK",null,null,27,"21SB2062","ADAM FEBRIANSYAH","IK"]
[28,"21SB2059","REGINA WIDITASARI","IK",null,null,28,"21SB2068","SHAFA HANA SALSABILA","IK"]
[29,"21SB2092","JOE PRADANA","IK",null,null,29,"21SB2102","ALANBIYAA MEYLDIYAWAN PRATAMA","IK"]
[30,"21SB2095","SYEVANA CAHYA AZIZAH","IK",null,null,30,"21SB2112","STEFFANIE MULYA VERNANDA","IK"]
[31,"21SB2133","RESTI ALVIANITA","IK",null,null,31,"21SB2143","BIANKA CITRA ADELIA","IK"]
[32,"21SB2135","ILHAM DIDIK PRAKOSO","IK",null,null,32,"21SB2147","DEVI PUTRI NAMIRA","IK"]
[]
[]
["KELOMPOK PELATIHAN SUPER UNGGUL (PSU)",{"$nulls":5},"KELOMPOK PELATIHAN SUPER UNGGUL (PSU)"]
["KELOMPOK P.8 ( Ruang 2.3 )",{"$nulls":5},"KELOMPOK S.8 ( Ruang 2.3 )"]
["RABU-KAMIS, 26-27 JANUARI 2022",{"$nulls":5},"RABU-KAMIS, 26-27 JANUARI 2022"]
["08.30-12.30 WIB",{"$nulls":5},"13.00-17.00 WIB"]
[]
["NO.","NIM","NAMA","PRODI",null,null,"NO.","NO.DAF","NAMA","PRODI"]
[]
[1,"21SA1011","ZAYNURI ILHAM BIMAWAN","IF",null,null,1,"21SA1020","GALANG YUDISTIRA","IF"]
[2,"21SA1039","EKO WIDODO","IF",null,null,2,"21SA1044","DESI INTAN PERTIWI","IF"]
[3,"21SA1073","BINTANG FITRAH RAMADHAN","IF",null,null,3,"21SA1051","IKHSAN DWI NUGROHO","IF"]
[4,"21SA1096","BUDI NUROHMAN","IF",null,null,4,"21SA1080","ZUHRUL FIRDAUS","IF"]
[5,"21SA1105","ZHAFIRA ARYANI PUTRI","IF",null,null,5,"21SA1103","RAFIK AKBAR SANDI ASMARA","IF"]
[6,"21SA1129","NURUL GINANJAR","IF",null,null,6,"21SA1130","MERISKA SINDI WIGUNA","IF"]
[7,"21SA1160","AGIL SATRIA ANCANG PAMUNGKAS","IF",null,null,7,"21SA1139","BINTANG NUR PRADANA","IF"]
[8,"21SA1179","LUSIANA TRIMULYANI","IF",null,null,8,"21SA1169","HAIKAL FA'IQ SETIAWAN","IF"]
[9,"21SA1185","AXEL ROYCE ARDINE ABIEZA","IF",null,null,9,"21SA1192","FIKRI KHOERUL AZMI","IF"]
[10,"21SA1208","ANDI ALIF ATTHORIQ","IF",null,null,10,"21SA1219","FARIS MUHAMMAD RIDHO","IF"]
[11,"21SA1243","ABU BAKAR SIDIK","IF",null,null,11,"21SA1236","NANDA MAHABATI YUJLA","IF"]
[12,"21SA1272","HENDRA PUTRA WAHYUDIN","IF",null,null,12,"21SA1252","MASNA ARINA PUTRI","IF"]
[13,"21SA2011","DIKA PRIYANTI","SI",null,null,13,"21SA2023","FARAH FADHILAH","SI"]
[14,"21SA2022","SHAFA IJLAL KURNIA PUTRA","SI",null,null,14,"21SA2035","RIZQI FATUROHMAN","SI"]
[15,"21SA2051","SINTA NUR CAHYANI","SI",null,null,15,"21SA2062","ASTRIDITIYA LAILA NUR FADILAH","SI"]
[16,"21SA2083","RAHAYU LINDA KUSUMA","SI",null,null,16,"21SA2094","WAHYUNING TYAS SARASWATI","SI"]
[17,"21SA2090","FAHMI AN NAAFI","SI",null,null,17,"21SA2121","ANASTASYA YUNIAR","SI"]
[18,"21SA3027","SATYO DWI APITIADI","TI",null,null,18,"21SA3057","FATHIN CAHYO RAMADHAN","TI"]
[19,"21SA3049","YOGA HENDRI PERMANA","TI",null,null,19,"21SA3063","NURUL HIDAYATI","TI"]
[20,"21SA3073","HOKKY ANGGARA SITEPU","TI",null,null,20,"21SA3079","MUHAMMAD ZIDAN ALAMSYAH","TI"]
[21,"21SA3097","YOUVAN FEBBY DEVANA","TI",null,null,21,"21SA3103","FIRMAN BAGUS SAPUTRO","TI"]
[22,"21SB1018","NANANG SETIADI","BD",null,null,22,"21SB1009","VIENDYA ARUM PUTRI WIDYA DHARMA","BD"]
[23,"21SB1031","DEWI SHANDRA SAFITRI","BD",null,null,23,"21SB1040","NANDA GANI QAMARUL AKHYAR","BD"]
[24,"21SB1067","CHOLID UMAR NABHAN","BD",null,null,24,"21SB1044","FANI SARASWATI","BD"]
[25,"21SB2003","WAHYU ROMADHONI","IK",null,null,25,"21SB2017","IMAM RAMADANI","IK"]
[26,"21SB2029","CITRA AULIA NANDA FARDIANTI","IK",null,null,26,"21SB2039","AUTRIANOVA INDRIA RAMADHANINGTYAS","IK"]
[27,"21SB2045","FADLI AL KAHFI","IK",null,null,27,"21SB2064","DIMAS NUR RIZKY","IK"]
[28,"21SB2060","KHURIDA BANATUZKA","IK",null,null,28,"21SB2070","AULYA NERAZZURI CAHYA PUTRI","IK"]
[29,"21SB2094","ALIF AL FATAH","IK",null,null,29,"21SB2106","HARKA DWI OKTAFA","IK"]
[30,"21SB2097","AFIFAH BEKTI NURAISYIYAH","IK",null,null,30,"21SB2114","ANINDHA JULIETA","IK"]
[31,"21SB2134","SONIA YESY PUSPITASARI","IK",null,null,31,"21SB2144","RINDA DALIANA","IK"]
[32,"21SB2136","ABDULLAH SOFYAN AHMADIN","IK",null,null,32,"21SB2149","FAUZAN HANIF MAULANA","IK"]
[]
[]
["KELOMPOK PELATIHAN SUPER UNGGUL (PSU)",{"$nulls":5},"KELOMPOK PELATIHAN SUPER UNGGUL (PSU)"]
["KELOMPOK P.9 ( Ruang 2.4 )",{"$nulls":5},"KELOMPOK S.9 ( Ruang 2.4 )"]
["RABU-KAMIS, 26-27 JANUARI 2022",{"$nulls":5},"RABU-KAMIS, 26-27 JANUARI 2022"]
["08.30-12.30 WIB",{"$nulls":5},"13.00-17.00 WIB"]
[]
["NO.","NIM","NAMA","PRODI",null,null,"NO.","NO.DAF","NAMA","PRODI"]
[]
[1,"21SA1001","FITRIANA MARISKA","IF",null,null,1,"21SA1021","JEFRI HARDIAWAN WIJAYA","IF"]
[2,"21SA1013","DAFFA SYAFI RAFIANTO","IF",null,null,2,"21SA1045","VIRGINA SERA YULIANI","IF"]
[3,"21SA1040","TRI SEPTO ARDIANSYAH","IF",null,null,3,"21SA1052","TAUFIK HIDAYATULLOH","IF"]
[4,"21SA1074","HISBULLOH BAGUS SUWANDI","IF",null,null,4,"21SA1082","UFU SAEFULLAH","IF"]
[5,"21SA1097","ALDI FAHLEVI","IF",null,null,5,"21SA1104","IWAN RAHMAT","IF"]
[6,"21SA1107","ARINA FATUNNISA","IF",null,null,6,"21SA1131","NGAINUL LATIFATUSSANI","IF"]
[7,"21SA1132","DARMA PRASTANTO","IF",null,null,7,"21SA1140","RAFLI BAYU SATRIO","IF"]
[8,"21SA1161","M. ZULFA NURREZA","IF",null,null,8,"21SA1170","MOH ASAD ZAKKY AUFAR","IF"]
[9,"21SA1186","ALFITO RADITYA PRAYOGI","IF",null,null,9,"21SA1193","LABIB NUR ALI","IF"]
[10,"21SA1210","IMUN FAIZAL","IF",null,null,10,"21SA1222","IRFAN FAUZI","IF"]
[11,"21SA1211","BINTARI WIDIANDINI","IF",null,null,11,"21SA1242","NOVAL RIZKIANA","IF"]
[12,"21SA1244","NOHAN JALADRI WIDARTO","IF",null,null,12,"21SA1253","DEO REZKY MUSLIAN NURAFFENDO","IF"]
[13,"21SA2012","ADINDA ARININTA LOYSIANA","SI",null,null,13,"21SA2029","VELLYN CHALISTA ELFANZA","SI"]
[14,"21SA2024","DAFFA EKONANDA","SI",null,null,14,"21SA2041","MUHAMMAD ASNAFI AL-KAROMI","SI"]
[15,"21SA2053","DISI FASA TRI RAHMAWATI","SI",null,null,15,"21SA2064","FALIA NUR AFIFAH","SI"]
[16,"21SA2086","NOVITA WAHYUNI","SI",null,null,16,"21SA2095","RATRI ISMAYANTI","SI"]
[17,"21SA2093","FEISHAL AZRIEL ARYA PUTRA","SI",null,null,17,"21SA2122","FADILAH MUSAFIROH","SI"]
[18,"21SA2115","ARISANTI DWI SAFITRI","SI",null,null,18,"21SA2124","MUHAMMAD AKHMAL AL RAIDHAN","SI"]
[19,"21SA2143","IQFI ABDUL FADLAN AL AZIZ","SI",null,null,19,"21SA2157","RIZKI ADHI PRATAMA","SI"]
[20,"21SA3002","ABID FAJAR SATRIO","TI",null,null,20,"21SA3009","AHSANAL JAZA","TI"]
[21,"21SA3024","ARUM VIKA NDARI","TI",null,null,21,"21SA3034","PULUNG SETIAWAN","TI"]
[22,"21SA3028","NUGROHO BOWO RAHARJO","TI",null,null,22,"21SA3058","FAHREZY CASA JULIARDANA","TI"]
[23,"21SA3050","SHOOFIN DHIAN MUHAMMAD FIKRI","TI",null,null,23,"21SA3080","ADHIKA YAN RANU WIJAYA","TI"]
[24,"21SA3074","DIMAS PRAMONO","TI",null,null,24,"21SA3083","INKA SAPUTRI","TI"]
[25,"21SA3098","DIMAS ARIF TRIONO","TI",null,null,25,"21SA3104","NURAL ADNAN GHANI ARTHA DWIANISSWARA","TI"]
[26,"21SB1019","MUHAMAD FARKHAN NURFAIZI","BD",null,null,26,"21SB1010","FARAH NABILA PRASTAWA","BD"]
[27,"21SB1036","JUWITA ANGGRAINI SAIN","BD",null,null,27,"21SB1041","WAHYU HARTANTO","BD"]
[28,"21SB1070","JENNY EKA MELIAN","BD",null,null,28,"21SB2071","DEA NANDA SAPUTRI","IK"]
[29,"21SB2096","MUHAMMAD FILLAR PERDANA KUSUMO","IK",null,null,29,"21SB2107","BAYU ALFAREZA","IK"]
[30,"21SB2099","PUTRI SULISTYANINGRUM","IK",null,null,30,"21SB2115","MAGHFIROH RIFANA","IK"]
[31,"21SB2137","PASSA ANZALLIKA","IK",null,null,31,"21SB2150","ANBIYA NOVAN PUTA RAMADHAN","IK"]
[32,"21SB2141","ALDY DAFFA SYAHPUTRA","IK",null,null,32,"21SB2151","CALLISTA SILWA NAYLA","IK"]
[]
[]
["KELOMPOK PELATIHAN SUPER UNGGUL (PSU)",{"$nulls":5},"KELOMPOK PELATIHAN SUPER UNGGUL (PSU)"]
["KELOMPOK P.10 ( Ruang 3.2 )",{"$nulls":5},"KELOMPOK S.10 ( Ruang 3.2 )"]
["RABU-KAMIS, 26-27 JANUARI 2022",{"$nulls":5},"RABU-KAMIS, 26-27 JANUARI 2022"]
["08.30-12.30 WIB",{"$nulls":5},"13.00-17.00 WIB"]
[]
["NO.","NIM","NAMA","PRODI",null,null,"NO.","NO.DAF","NAMA","PRODI"]
[]
[1,"21SA1005","NUR ASYSYIFA FEBRIYANTI","IF",null,null,1,"21SA1022","FARREL YODHA KUMARA","IF"]
[2,"21SA1014","BAGAS KUMARA MAJID","IF",null,null,2,"21SA1046","FADIA NUR ANNISA","IF"]
[3,"21SA1041","MUHAMMAD RAIHAN RIZALDI","IF",null,null,3,"21SA1053","DANAR RAFI HANGGARJATI","IF"]
[4,"21SA1075","DZIKRI RIANDRI PRATAMA","IF",null,null,4,"21SA1083","ADI PANGESTU","IF"]
[5,"21SA1098","SYAHRUL SANI","IF",null,null,5,"21SA1106","AZIS FAJAR MAULANA","IF"]
[6,"21SA1109","AULIA DIAN AGUSTINA","IF",null,null,6,"21SA1120","BAHID","IF"]
[7,"21SA1133","HARUN AL RASYID","IF",null,null,7,"21SA1134","AZHAR ARIH RONA","IF"]
[8,"21SA1163","RISKI NUR ROHMAN","IF",null,null,8,"21SA1141","JOSE LANANG SADEWA","IF"]
[9,"21SA1187","IBNU HIBBAN","IF",null,null,9,"21SA1171","CORNELIS TRIADI KURNIAWAN","IF"]
[10,"21SA1212","RIZQA AYUNINGSIH","IF",null,null,10,"21SA1194","RIZKY AULIA RAHMAN","IF"]
[11,"21SA1214","MASARIYANTO","IF",null,null,11,"21SA1224","M. FAHRIZA UMAMI","IF"]
[12,"21SA1247","FEBRIAN AVIEN WIBOWO","IF",null,null,12,"21SA1249","FEBIA SEKAR RAMADANI","IF"]
[13,"21SA2013","NAURA FARICA RACHMAN","SI",null,null,13,"21SA1254","MUHAMMAD HILMIY NUGRAHA","IF"]
[14,"21SA2025","FAUZAN DWICAH SAPUTRA","SI",null,null,14,"21SA2033","GELIS RAHAYU","SI"]
[15,"21SA2054","ARISKA NURUL HABIBAH","SI",null,null,15,"21SA2046","IQBAL YUSUF AZHARI","SI"]
[16,"21SA2087","AMANDA FITRIA DESVITA","SI",null,null,16,"21SA2065","EPA LATIFAH","SI"]
[17,"21SA2100","PRAYOGA SUSENO","SI",null,null,17,"21SA2098","FARAH MEI MAULIDA","SI"]
[18,"21SA2116","DISYA ADHIETYA YULANDINI","SI",null,null,18,"21SA2125","MATSNAN HAQQI","SI"]
[19,"21SA2146","RAHMAT AJI PRASETYO","SI",null,null,19,"21SA2126","VITA DWI UTAMI","SI"]
[20,"21SA3004","JIHAN WARDANI","TI",null,null,20,"21SA2158","YOGO AZMI ARUNDAYA","SI"]
[21,"21SA3029","YUSUF FAHRIZAL","TI",null,null,21,"21SA3011","FANI YULIANTO","TI"]
[22,"21SA3043","DELIA OKTAVIANA AZZAHRA","TI",null,null,22,"21SA3035","ZULKARNAIN","TI"]
[23,"21SA3051","AKSANA ZACHRI SATRIA","TI",null,null,23,"21SA3059","SYAIFULLOH DWI SAPUTRA","TI"]
[24,"21SA3075","SEPTIAN YOGA PRATAMA","TI",null,null,24,"21SA3081","RIZKY SATRIA MAHARDIKA","TI"]
[25,"21SA3099","ANZALNADI AZZUKRUF FAIRLY","TI",null,null,25,"21SA3090","NOVA AZZAHRA","TI"]
[26,"21SB1003","AFINDA NATHANIA ANINDYA MAYANG","BD",null,null,26,"21SA3105","ABDULLAH ZAID AZAMI","TI"]
[27,"21SB1021","YUHANKA RADITYA ALAUDDIN","BD",null,null,27,"21SB1011","SHEFIRA AURELIA SAFITRI","BD"]
[28,"21SB1037","DEFIRLI CITRA AMANDA","BD",null,null,28,"21SB1042","MUHAMMAD MAHENDRA","BD"]
[29,"21SB2098","FIKRI ERWAN MAULANA","IK",null,null,29,"21SB1047","AMANDA AYU MAWARNI","BD"]
[30,"21SB2103","NABIILA HUWAINATI NISA","IK",null,null,30,"21SB2072","CHIKA AYUNDA LISTIANI","IK"]
[31,"21SB2138","ANANTA RAHMA HERDIYANTI","IK",null,null,31,"21SB2108","MUKHAMAD ALFARIZI","IK"]
[32,"21SB2142","DAVID FRIDAY BARKAH","IK",null,null,32,"21SB2116","NURITA MUHAMAD","IK"]