{"text_format":"3","workbook":"xlsx","n_sheets":6,"sheets":["24-25","Sheet1","Sheet2","rekap","Sheet4","26-27"],"not_rendered":{"defined_names":5},"read":"whole","date_system":"1900"}

{"sheet":"24-25","index":0,"n_rows":182,"n_cols":10,"rows_kept":182,"merged":[[0,0,0,3],[0,6,0,9],[1,0,1,3],[1,6,1,9],[2,0,2,3],[2,6,2,9],[3,0,3,3],[3,6,3,9],[5,0,6,0],[5,1,6,1],[5,2,6,2],[5,3,6,3],[5,6,6,6],[5,7,6,7],[5,8,6,8],[5,9,6,9],[61,0,61,3],[61,6,61,9],[62,0,62,3],[62,6,62,9],[63,0,63,3],[63,6,63,9],[64,0,64,3],[64,6,64,9],[66,0,67,0],[66,1,67,1],[66,2,67,2],[66,3,67,3],[66,6,67,6],[66,7,67,7],[66,8,67,8],[66,9,67,9],[102,0,102,3],[102,6,102,9],[103,0,103,3],[103,6,103,9],[104,0,104,3],[104,6,104,9],[105,0,105,3],[105,6,105,9],[107,0,108,0],[107,1,108,1],[107,2,108,2],[107,3,108,3],[107,6,108,6],[107,7,108,7],[107,8,108,8],[107,9,108,9],[143,0,143,3],[143,6,143,9],[144,0,144,3],[144,6,144,9],[145,0,145,3],[145,6,145,9],[146,0,146,3],[146,6,146,9],[148,0,149,0],[148,1,149,1],[148,2,149,2],[148,3,149,3],[148,6,149,6],[148,7,149,7],[148,8,149,8],[148,9,149,9]]}
["KELOMPOK PELATIHAN SUPER UNGGUL (PSU)",{"$nulls":5},"KELOMPOK PELATIHAN SUPER UNGGUL (PSU)"]
["KELOMPOK P.1 ( Ruang AULA )",{"$nulls":5},"KELOMPOK S.1 ( Ruang AULA )"]
["SENIN-SELASA, 24-25 JANUARI 2022",{"$nulls":5},"SENIN-SELASA, 24-25 JANUARI 2022"]
["08.30-12.30 WIB",{"$nulls":5},"13.00-17.00 WIB"]
[]
["NO.","NIM","NAMA","PRODI",null,null,"NO.","NO.DAF","NAMA","PRODI"]
[]
[1,"17.11.0321","RACHMADDANI","IF",null,null,1,"21SA1002","HARIS JUNIANTO","IF"]
[2,"21SA1023","AGENG DWI KURNIAWAN","IF",null,null,2,"21SA1032","IZAZ ZEIN WIVA AIMAR","IF"]
[3,"21SA1054","NIZAR MURDIJAT","IF",null,null,3,"21SA1060","DAFFA KURNIA PUTRA","IF"]
[4,"21SA1055","PUTRI FEBI UTAMI","IF",null,null,4,"21SA1069","INTAN SOFIATUN","IF"]
[5,"21SA1057","FAISHAL AZHAR NURRAFI","IF",null,null,5,"21SA1070","DINA NURHASANAH","IF"]
[6,"21SA1061","RIZKI FAJAR SEPTIANA","IF",null,null,6,"21SA1089","SANDHYA NUGRAHA QUSNUR AULIA","IF"]
[7,"21SA1084","ROFIQ 'ABDUL ROZAK","IF",null,null,7,"21SA1090","ROBIT KHOERULLOH ARROHMAN","IF"]
[8,"21SA1085","HAIDAR RO'IF","IF",null,null,8,"21SA1117","SAIFULLAH ABIMANYU","IF"]
[9,"21SA1086","MUHAMMAD THORIQ JAMIL","IF",null,null,9,"21SA1119","IQROM ABADI","IF"]
[10,"21SA1112","RIFQI ARIFIN ILHAM","IF",null,null,10,"21SA1147","BENNY PRAYOGO","IF"]
[11,"21SA1114","MUHAMMAD HABIB AL HUDRY","IF",null,null,11,"21SA1149","PRAS TIO RIFKI WIJAYA","IF"]
[12,"21SA1115","WIDYA TRI PURNOMO","IF",null,null,12,"21SA1154","AMIRA AIDA RASHIFA","IF"]
[13,"21SA1138","TIARA DEWI OKTAVIANI","IF",null,null,13,"21SA1177","ALIF FAJRIANSYAH","IF"]
[14,"21SA1142","CHANDRA WAHYU RAFIALDI","IF",null,null,14,"21SA1200","BINTANG FEBRIAND","IF"]
[15,"21SA1143","TEDY ARGO PRATAMA","IF",null,null,15,"21SA1230","FAQIH SANDI LANGIT","IF"]
[16,"21SA1144","MUHAMMAD RAMADA ADITYA","IF",null,null,16,"21SA1259","FIRMAN FATHONI","IF"]
[17,"21SA1172","DHEVRAN BAITU ABDILLAH SINTUSA","IF",null,null,17,"21SA1262","GALANG ARSANDY NOVERDAN PUTRA","IF"]
[18,"21SA1195","GALIONO FAUZAN ALRASYID","IF",null,null,18,"21SA2003","FAKHRUL AKIF MAULANA PUTRA","SI"]
[19,"21SA1225","OAY HERDIAN JAYA SUBAGJA","IF",null,null,19,"21SA2004","ATIK NURHAENI","SI"]
[20,"21SA1255","AFIF WALIYUDIN","IF",null,null,20,"21SA2010","I PUTU NOVANDA JAYA ASDANU","SI"]
[21,"21SA1266","NAILATUL FAIZAH","IF",null,null,21,"21SA2042","IIS SAHITA","SI"]
[22,"21SA2034","TITIN AMELIA","SI",null,null,22,"21SA2044","ANINDYA FIDELA","SI"]
[23,"21SA2048","DAFA ARTA ANGGARA","SI",null,null,23,"21SA2063","RIFQI MUBAROK","SI"]
[24,"21SA2066","ADE CHINTYA ALFIANA HALALUTU","SI",null,null,24,"21SA2071","AYU LESTARI","SI"]
[25,"21SA2099","EL SYAFANGATUN AULIA DIFA","SI",null,null,25,"21SA2107","ISNAUROKHMAH","SI"]
[26,"21SA2127","FISABILLA TIDAR YOGA PRATAMA","SI",null,null,26,"21SA2132","MUHAMMAD AMRIZAL","SI"]
[27,"21SA2130","AMELIA RAHMADANI","SI",null,null,27,"21SA2147","MUTIARA VEDA YESENIA","SI"]
[28,"21SA2141","SALSA FATHATURRAHMA","SI",null,null,28,"21SA2153","NAURA ARUM KARTIKA","SI"]
[29,"21SA2159","ADITIYA SADANA","SI",null,null,29,"21SA2164","RIZQY RIDWAN HAMID","SI"]
[30,"21SA2162","DIMAS REVINDRA MARAGITA","SI",null,null,30,"21SA3018","ZULFA CHAFIDZ NUR","TI"]
[31,"21SA3014","YUSRON ALIF ADHITYA","TI",null,null,31,"21SA3022","ADE TOTI FEBRIAN","TI"]
[32,"21SA3017","DIMAS TEGAR PRAKOSO","TI",null,null,32,"21SA3040","RESTU HIDAYAT","TI"]
[33,"21SA3036","MUFTI ABDILLAH ALFAN","TI",null,null,33,"21SA3045","MUHAMMAD LUQMANUL HAKIM","TI"]
{"$rows_left_out":143}
{"sheet":"Sheet1","index":1,"n_rows":495,"n_cols":6,"rows_kept":495,"hidden":true}
["nodaf",null,"NPM","NAMA","x","y"]
["170001AO",{"$f":"VALUE(LEFT(A2,6))","v":170001},"17.11.0001","DITA FERDIAN BAYU KUSUMA",{"$f":"C2","v":"17.11.0001"},{"$f":"COUNTIF(#REF!,E2)","v":{"$error":"#REF!"}}]
["170006AO",170006,"17.11.0002","RIZQI MUSTHOFA",{"$f":"C3","v":"17.11.0002"},{"$f":"COUNTIF(#REF!,E3)","v":{"$error":"#REF!"}}]
["170024AO",170024,"17.11.0003","JANUARIO SUBECTI BANO","17.11.0003",{"$f":"COUNTIF(#REF!,E4)","v":{"$error":"#REF!"}}]
["170023AO",170023,"17.11.0004","LABIB FAUZI RAMADAN","17.11.0004",{"$f":"COUNTIF(#REF!,E5)","v":{"$error":"#REF!"}}]
["170026AO",170026,"17.11.0005","NANA SABRINA","17.11.0005",{"$f":"COUNTIF(#REF!,E6)","v":{"$error":"#REF!"}}]
["170008AO",170008,"17.11.0006","BIMA RASENDRIYA INDRASTOTO","17.11.0006",{"$f":"COUNTIF(#REF!,E7)","v":{"$error":"#REF!"}}]
["170016AO",170016,"17.11.0007","RANGGA GUSTI ANANTA","17.11.0007",{"$f":"COUNTIF(#REF!,E8)","v":{"$error":"#REF!"}}]
["170007AO",170007,"17.11.0008","AZIZAN NURHAKIM","17.11.0008",{"$f":"COUNTIF(#REF!,E9)","v":{"$error":"#REF!"}}]
["170022AO",170022,"17.11.0009","SUSANTO","17.11.0009",{"$f":"COUNTIF(#REF!,E10)","v":{"$error":"#REF!"}}]
["170020AO",170020,"17.11.0010","RIYAN EKO SAPUTRA","17.11.0010",{"$f":"COUNTIF(#REF!,E11)","v":{"$error":"#REF!"}}]
["170037AO",170037,"17.11.0011","MOHAMAD BAGUS WIDIYANTO","17.11.0011",{"$f":"COUNTIF(#REF!,E12)","v":{"$error":"#REF!"}}]
["170049AO",170049,"17.11.0012","LAELATUL ROFIDA","17.11.0012",{"$f":"COUNTIF(#REF!,E13)","v":{"$error":"#REF!"}}]
["170066AO",170066,"17.11.0013","RANGGA PRANGWEDANA JANUWARSA","17.11.0013",{"$f":"COUNTIF(#REF!,E14)","v":{"$error":"#REF!"}}]
["170073AO",170073,"17.11.0014","SEPTIAN PRIMANSYAH","17.11.0014",{"$f":"COUNTIF(#REF!,E15)","v":{"$error":"#REF!"}}]
["170040AO",170040,"17.11.0015","DEBI INDARTO","17.11.0015",{"$f":"COUNTIF(#REF!,E16)","v":{"$error":"#REF!"}}]
["170051AO",170051,"17.11.0016","ARIEF KURNIA RAMADHANI","17.11.0016",{"$f":"COUNTIF(#REF!,E17)","v":{"$error":"#REF!"}}]
["170069AO",170069,"17.11.0017","YUSUF SUPRIYATNA","17.11.0017",{"$f":"COUNTIF(#REF!,E18)","v":{"$error":"#REF!"}}]
["170082AO",170082,"17.11.0018","KURNIAWAN SAPUTRA","17.11.0018",{"$f":"COUNTIF(#REF!,E19)","v":{"$error":"#REF!"}}]
["170030AO",170030,"17.11.0019","CANDRA YANUAR DWI  NURCAHYO","17.11.0019",{"$f":"COUNTIF(#REF!,E20)","v":{"$error":"#REF!"}}]
["170092AO",170092,"17.11.0020","AFIF MA'RUF ESKA","17.11.0020",{"$f":"COUNTIF(#REF!,E21)","v":{"$error":"#REF!"}}]
["170095AO",170095,"17.11.0021","SOLEH NUR HAYAT","17.11.0021",{"$f":"COUNTIF(#REF!,E22)","v":{"$error":"#REF!"}}]
["170101AO",170101,"17.11.0022","AURORA DWI KHATULISTIAN","17.11.0022",{"$f":"COUNTIF(#REF!,E23)","v":{"$error":"#REF!"}}]
["170060AO",170060,"17.11.0023","DARMORO WINANJAR SASMIKO","17.11.0023",{"$f":"COUNTIF(#REF!,E24)","v":{"$error":"#REF!"}}]
["170072AO",170072,"17.11.0024","ASEP SETIAJI","17.11.0024",{"$f":"COUNTIF(#REF!,E25)","v":{"$error":"#REF!"}}]
["170115AO",170115,"17.11.0025","RAHILA NUR JANAH","17.11.0025",{"$f":"COUNTIF(#REF!,E26)","v":{"$error":"#REF!"}}]
["170111AO",170111,"17.11.0026","CHRISTIANTO TRI MULYANTO PUTRA","17.11.0026",{"$f":"COUNTIF(#REF!,E27)","v":{"$error":"#REF!"}}]
["170071AO",170071,"17.11.0027","PUTU LEO KHARISMA BANGSA","17.11.0027",{"$f":"COUNTIF(#REF!,E28)","v":{"$error":"#REF!"}}]
["170002AO",170002,"17.11.0028","DAFFA RIZQI ANDRIAN","17.11.0028",{"$f":"COUNTIF(#REF!,E29)","v":{"$error":"#REF!"}}]
["170096AO",170096,"17.11.0029","AHMAD ALWI RAHMAN","17.11.0029",{"$f":"COUNTIF(#REF!,E30)","v":{"$error":"#REF!"}}]
["170035AO",170035,"17.11.0030","ENTUK AJI NUGROHO","17.11.0030",{"$f":"COUNTIF(#REF!,E31)","v":{"$error":"#REF!"}}]
["170070AO",170070,"17.11.0031","WISNU PRASETYA","17.11.0031",{"$f":"COUNTIF(#REF!,E32)","v":{"$error":"#REF!"}}]
["170052AO",170052,"17.11.0032","AFFAN AZ ZARQONI","17.11.0032",{"$f":"COUNTIF(#REF!,E33)","v":{"$error":"#REF!"}}]
["170055AO",{"$f":"VALUE(LEFT(A34,6))","v":170055},"17.11.0033","DEDY ISTIADY PUJIANADA","17.11.0033",{"$f":"COUNTIF(#REF!,E34)","v":{"$error":"#REF!"}}]
["170045AO",170045,"17.11.0034","FAUZAN AJI","17.11.0034",{"$f":"COUNTIF(#REF!,E35)","v":{"$error":"#REF!"}}]
["170160AO",170160,"17.11.0035","FARIS KELVIANTO","17.11.0035",{"$f":"COUNTIF(#REF!,E36)","v":{"$error":"#REF!"}}]
["170116AO",170116,"17.11.0036","KRISNO","17.11.0036",{"$f":"COUNTIF(#REF!,E37)","v":{"$error":"#REF!"}}]
["170034AO",170034,"17.11.0037","JUAN SEBACHTIAN","17.11.0037",{"$f":"COUNTIF(#REF!,E38)","v":{"$error":"#REF!"}}]
["170107AO",170107,"17.11.0038","NURAZIS ADHIRAMA PAMUNGKAS","17.11.0038",{"$f":"COUNTIF(#REF!,E39)","v":{"$error":"#REF!"}}]
["170150AO",170150,"17.11.0039","WAHYU BUDI PRAKOSO","17.11.0039",{"$f":"COUNTIF(#REF!,E40)","v":{"$error":"#REF!"}}]
{"$rows_left_out":456}
{"sheet":"Sheet2","index":2,"n_rows":692,"n_cols":9,"rows_kept":692,"hidden":true}
["KELOMPOK PELATIHAN SUPER UNGGUL (PSU)"]
["KELOMPOK A.1 ( Ruang AULA )"]
["RABU, 10 MEI 2017"]
["09.00 - 13.00"]
[]
["NO.","NO.DAF","NAMA","PRODI","JENIS","PARAF"]
[{"$nulls":4},"KELAMIN"]
[1,170014,"ABDUL GHOFUR","TI","L",1,null,"17.11.0047","A"]
[2,170038,"ACHMAD DIAN RAFI'I","TI SORE","L",null,2,"17.11.0049","B"]
[3,170003,"ADIT TRI SEPTIAWAN","TI","L",3,null,"17.11.0243","B"]
[4,170052,"AFFAN AZ ZARQONI","TI","L",null,4,"17.11.0032","C"]
[5,170050,"AFREL PUTRA MAHENDRA","TI","L",5,null,"17.11.0042","A"]
[6,170031,"ANINDYA ANGGELINA","SI","P",null,6,"17.12.0012","A"]
[7,170018,"ARI NUR RIZKI","TI","L",7,null,"17.11.0048","A"]
[8,170047,"BAGAS WARDANA","SI","L",null,8,"17.12.0002","B"]
[9,170008,"BIMA RASENDRIYA INDRASTOTO","TI","L",9,null,"17.11.0006","A"]
[10,170009,"CANDRA NOVIAN","SI","L",null,10,"17.12.0005","A"]
[11,170039,"CHINTIA DINI PRATIWI","SI","P",11,null,{"$error":"#N/A"},"D"]
[12,170002,"DAFFA RIZQI ANDRIAN","TI","L",null,12,"17.11.0028","A"]
[13,170040,"DEBI INDARTO","TI","L",13,null,"17.11.0015","A"]
[14,170025,"DIMAS AJI PRASETYO","TI","L",null,14,"17.11.0242","A"]
[15,170001,"DITA FERDIAN BAYU KUSUMA","TI","L",15,null,"17.11.0001","B"]
[16,170041,"EKY SETIAWAN","SI","L",null,16,"17.12.0003","A"]
[17,170035,"ENTUK AJI NUGROHO","TI","L",17,null,"17.11.0030","A"]
[18,170004,"GAGAT BASKORO SYAH","TI SORE","L",null,18,"17.11.0073","A"]
[19,170019,"GILANG RIZKY MUSTOFA","TI","L",19,null,"17.11.0191","C"]
[20,170012,"IFANIA OKTAVIANI PUTRI","SI","P",null,20,"17.12.0011","A"]
[21,170032,"IVAN SURYA WITANTO","TI SORE","L",21,null,"17.11.0337","C"]
[22,170178,"JALUMIYOS RAMADHIANSYAH","TI","L",null,22,"17.12.0065","A"]
[23,170024,"JANUARIO SUBECTI BANO","TI SORE","L",23,null,"17.11.0003","D"]
[24,170023,"LABIB FAUZI RAMADAN","TI","L",null,24,"17.11.0004","A"]
[25,170049,"LAELATUL ROFIDA","TI","P",25,null,"17.11.0012","A"]
[26,170037,"MOHAMAD BAGUS WIDIYANTO","TI SORE","L",null,26,"17.11.0011","C"]
[27,170026,"NANA SABRINA","TI","P",27,null,"17.11.0005","A"]
[28,170017,"NUR LAELI RACHMAWATI","SI","P",null,28,"17.12.0001","A"]
[29,170183,"NUR ROCHMAN ALFATONI","TI","L",29,null,"17.11.0068","A"]
[30,170016,"RANGGA GUSTI ANANTA","TI SORE","L",null,30,"17.11.0007","C"]
[31,170066,"RANGGA PRANGWEDAWA JANUWARSA","TI","L",31,null,"17.11.0013","C"]
[32,170021,"RIAN PRIADI","TI SORE","L",null,32,"17.11.0043","A"]
[33,170020,"RIYAN EKO SAPUTRA","TI SORE","L",33,null,"17.11.0010","D"]
{"$rows_left_out":653}
{"sheet":"rekap","index":3,"n_rows":528,"n_cols":7,"rows_kept":528,"hidden":true}
["NO.","NO.DAF","NAMA","nama","x","nil","ket"]
[1,170014,"ABDUL GHOFUR",{"$f":"VLOOKUP(E2,Sheet1!$C$2:$D$495,2,0)","v":"ABDUL GHOFUR"},"17.11.0047","A",{"$f":"IF(C2=D2,\"Sama\",\"Tidak\")","v":"Sama"}]
[2,170038,"ACHMAD DIAN RAFI'I",{"$f":"VLOOKUP(E3,Sheet1!$C$2:$D$495,2,0)","v":"ACHMAD DIAN RAFI'I"},"17.11.0049","B","Sama"]
[3,170003,"ADIT TRI SEPTIAWAN",{"$f":"VLOOKUP(E4,Sheet1!$C$2:$D$495,2,0)","v":"ADIT TRI SEPTIAWAN"},"17.11.0243","B","Sama"]
[4,170052,"AFFAN AZ ZARQONI",{"$f":"VLOOKUP(E5,Sheet1!$C$2:$D$495,2,0)","v":"AFFAN AZ ZARQONI"},"17.11.0032","C","Sama"]
[5,170050,"AFREL PUTRA MAHENDRA",{"$f":"VLOOKUP(E6,Sheet1!$C$2:$D$495,2,0)","v":"AFREL PUTRA MAHENDRA"},"17.11.0042","A","Sama"]
[6,170031,"ANINDYA ANGGELINA",{"$f":"VLOOKUP(E7,Sheet1!$C$2:$D$495,2,0)","v":"ANINDYA ANGGELINA"},"17.12.0012","A","Sama"]
[7,170018,"ARI NUR RIZKI",{"$f":"VLOOKUP(E8,Sheet1!$C$2:$D$495,2,0)","v":"ARI NUR RIZKI"},"17.11.0048","A","Sama"]
[8,170047,"BAGAS WARDANA",{"$f":"VLOOKUP(E9,Sheet1!$C$2:$D$495,2,0)","v":"BAGAS WARDANA"},"17.12.0002","B","Sama"]
[9,170008,"BIMA RASENDRIYA INDRASTOTO",{"$f":"VLOOKUP(E10,Sheet1!$C$2:$D$495,2,0)","v":"BIMA RASENDRIYA INDRASTOTO"},"17.11.0006","A","Sama"]
[10,170009,"CANDRA NOVIAN",{"$f":"VLOOKUP(E11,Sheet1!$C$2:$D$495,2,0)","v":"CANDRA NOVIAN"},"17.12.0005","A","Sama"]
[12,170002,"DAFFA RIZQI ANDRIAN",{"$f":"VLOOKUP(E12,Sheet1!$C$2:$D$495,2,0)","v":"DAFFA RIZQI ANDRIAN"},"17.11.0028","A","Sama"]
[13,170040,"DEBI INDARTO",{"$f":"VLOOKUP(E13,Sheet1!$C$2:$D$495,2,0)","v":"DEBI INDARTO"},"17.11.0015","A","Sama"]
[14,170025,"DIMAS AJI PRASETYO",{"$f":"VLOOKUP(E14,Sheet1!$C$2:$D$495,2,0)","v":"DIMAS AJI PRASETYO"},"17.11.0242","A","Sama"]
[15,170001,"DITA FERDIAN BAYU KUSUMA",{"$f":"VLOOKUP(E15,Sheet1!$C$2:$D$495,2,0)","v":"DITA FERDIAN BAYU KUSUMA"},"17.11.0001","B","Sama"]
[16,170041,"EKY SETIAWAN",{"$f":"VLOOKUP(E16,Sheet1!$C$2:$D$495,2,0)","v":"EKY SETIAWAN"},"17.12.0003","A","Sama"]
[17,170035,"ENTUK AJI NUGROHO",{"$f":"VLOOKUP(E17,Sheet1!$C$2:$D$495,2,0)","v":"ENTUK AJI NUGROHO"},"17.11.0030","A","Sama"]
[18,170004,"GAGAT BASKORO SYAH",{"$f":"VLOOKUP(E18,Sheet1!$C$2:$D$495,2,0)","v":"GAGAT BASKORO SYAH"},"17.11.0073","A","Sama"]
[19,170019,"GILANG RIZKY MUSTOFA",{"$f":"VLOOKUP(E19,Sheet1!$C$2:$D$495,2,0)","v":"GILANG RIZKY MUSTOFA"},"17.11.0191","C","Sama"]
[20,170012,"IFANIA OKTAVIANI PUTRI",{"$f":"VLOOKUP(E20,Sheet1!$C$2:$D$495,2,0)","v":"IFANIA OKTAVIANI PUTRI"},"17.12.0011","A","Sama"]
[21,170032,"IVAN SURYA WITANTO",{"$f":"VLOOKUP(E21,Sheet1!$C$2:$D$495,2,0)","v":"IVAN SURYA WITANTO"},"17.11.0337","C","Sama"]
[23,170024,"JANUARIO SUBECTI BANO",{"$f":"VLOOKUP(E22,Sheet1!$C$2:$D$495,2,0)","v":"JANUARIO SUBECTI BANO"},"17.11.0003","D","Sama"]
[24,170023,"LABIB FAUZI RAMADAN",{"$f":"VLOOKUP(E23,Sheet1!$C$2:$D$495,2,0)","v":"LABIB FAUZI RAMADAN"},"17.11.0004","A","Sama"]
[25,170049,"LAELATUL ROFIDA",{"$f":"VLOOKUP(E24,Sheet1!$C$2:$D$495,2,0)","v":"LAELATUL ROFIDA"},"17.11.0012","A","Sama"]
[26,170037,"MOHAMAD BAGUS WIDIYANTO",{"$f":"VLOOKUP(E25,Sheet1!$C$2:$D$495,2,0)","v":"MOHAMAD BAGUS WIDIYANTO"},"17.11.0011","C","Sama"]
[27,170026,"NANA SABRINA",{"$f":"VLOOKUP(E26,Sheet1!$C$2:$D$495,2,0)","v":"NANA SABRINA"},"17.11.0005","A","Sama"]
[28,170017,"NUR LAELI RACHMAWATI",{"$f":"VLOOKUP(E27,Sheet1!$C$2:$D$495,2,0)","v":"NUR LAELI RACHMAWATI"},"17.12.0001","A","Sama"]
[30,170016,"RANGGA GUSTI ANANTA",{"$f":"VLOOKUP(E28,Sheet1!$C$2:$D$495,2,0)","v":"RANGGA GUSTI ANANTA"},"17.11.0007","C","Sama"]
[32,170021,"RIAN PRIADI",{"$f":"VLOOKUP(E29,Sheet1!$C$2:$D$495,2,0)","v":"RIAN PRIADI"},"17.11.0043","A","Sama"]
[33,170020,"RIYAN EKO SAPUTRA",{"$f":"VLOOKUP(E30,Sheet1!$C$2:$D$495,2,0)","v":"RIYAN EKO SAPUTRA"},"17.11.0010","D","Sama"]
[34,170006,"RIZQI MUSTHOFA",{"$f":"VLOOKUP(E31,Sheet1!$C$2:$D$495,2,0)","v":"RIZQI MUSTHOFA"},"17.11.0002","A","Sama"]
[1,170015,"ADAM AMIRUDIN",{"$f":"VLOOKUP(E32,Sheet1!$C$2:$D$495,2,0)","v":"ADAM AMIRUDIN"},"17.11.0046","A","Sama"]
[2,170092,"AFIF MA'RUF ESKA",{"$f":"VLOOKUP(E33,Sheet1!$C$2:$D$495,2,0)","v":"AFIF MA'RUF ESKA"},"17.11.0020","A","Sama"]
[3,170064,"ALFIAN KUKUH ADITAMA",{"$f":"VLOOKUP(E34,Sheet1!$C$2:$D$495,2,0)","v":"ALFIAN KUKUH ADITAMA"},"17.11.0229","A","Sama"]
[4,170063,"APRILIA MELI KRISTINA",{"$f":"VLOOKUP(E35,Sheet1!$C$2:$D$495,2,0)","v":"APRILIA MELI KRISTINA"},"17.12.0067","A","Sama"]
[5,170053,"ARIF SUPRIYONO",{"$f":"VLOOKUP(E36,Sheet1!$C$2:$D$495,2,0)","v":"ARIF SUPRIYONO"},"17.11.0044","A","Sama"]
[6,170072,"ASEP SETIAJI",{"$f":"VLOOKUP(E37,Sheet1!$C$2:$D$495,2,0)","v":"ASEP SETIAJI"},"17.11.0024","A","Sama"]
[7,170030,"CANDRA YANUAR DWI  NURCAHYO",{"$f":"VLOOKUP(E38,Sheet1!$C$2:$D$495,2,0)","v":"CANDRA YANUAR DWI  NURCAHYO"},"17.11.0019","A","Sama"]
[8,170060,"DARMORO WINANJAR SASMIKO",{"$f":"VLOOKUP(E39,Sheet1!$C$2:$D$495,2,0)","v":"DARMORO WINANJAR SASMIKO"},"17.11.0023","D","Sama"]
[9,170055,"DEDY ISTIADY PUJIANADA",{"$f":"VLOOKUP(E40,Sheet1!$C$2:$D$495,2,0)","v":"DEDY ISTIADY PUJIANADA"},"17.11.0033","A","Sama"]
{"$rows_left_out":489}
{"sheet":"Sheet4","index":4,"n_rows":20,"n_cols":7,"rows_kept":20,"hidden":true}
[20,170161,"TRI SETYARANI DEWI",{"$error":"#N/A"},null,"A",{"$error":"#N/A"}]
[25,170205,"FITA DWI LESTARI",{"$error":"#N/A"},null,"A",{"$error":"#N/A"}]
[12,170313,"LUPITA INDAH FERISKA",{"$error":"#N/A"},null,"D",{"$error":"#N/A"}]
[28,170377,"MUHAMMAD FATIKHUL BIRRI",{"$error":"#N/A"},null,"D",{"$error":"#N/A"}]
[24,170405,"RISKI AHMAD YUSRON",{"$error":"#N/A"},null,"E",{"$error":"#N/A"}]
[14,170463,"RIZKA NUR ROFI'AH",{"$error":"#N/A"},null,"A",{"$error":"#N/A"}]
[20,170375,"MOHAMAD FAIQ NURROHMAN",{"$error":"#N/A"},null,"A",{"$error":"#N/A"}]
[11,170039,"CHINTIA DINI PRATIWI",{"$f":"VLOOKUP(E8,Sheet1!$C$2:$D$495,2,0)","v":{"$error":"#N/A"}},{"$error":"#N/A"},"D",{"$f":"IF(C8=D8,\"Sama\",\"Tidak\")","v":{"$error":"#N/A"}}]
[20,170076,"REFIANTO RIZKY CANDRA S",{"$f":"VLOOKUP(E9,Sheet1!$C$2:$D$495,2,0)","v":{"$error":"#N/A"}},{"$error":"#N/A"},"B",{"$error":"#N/A"}]
[22,170078,"RIZAL RENALDO",{"$f":"VLOOKUP(E10,Sheet1!$C$2:$D$495,2,0)","v":{"$error":"#N/A"}},{"$error":"#N/A"},"D",{"$error":"#N/A"}]
[26,170074,"SUKRON ANASIR",{"$f":"VLOOKUP(E11,Sheet1!$C$2:$D$495,2,0)","v":{"$error":"#N/A"}},{"$error":"#N/A"},"A",{"$error":"#N/A"}]
[20,170097,"LUTHFIYA HATI ISLAMI",{"$f":"VLOOKUP(E12,Sheet1!$C$2:$D$495,2,0)","v":{"$error":"#N/A"}},{"$error":"#N/A"},"B",{"$error":"#N/A"}]
[21,170144,"MEI ANGGUN TRIANA",{"$f":"VLOOKUP(E13,Sheet1!$C$2:$D$495,2,0)","v":{"$error":"#N/A"}},{"$error":"#N/A"},"A",{"$error":"#N/A"}]
[25,170099,"SAKTIANA ARIFFATUN NISA",{"$f":"VLOOKUP(E14,Sheet1!$C$2:$D$495,2,0)","v":{"$error":"#N/A"}},{"$error":"#N/A"},"D",{"$error":"#N/A"}]
[33,170124,"YOGA EKO PUJIANTO",{"$f":"VLOOKUP(E15,Sheet1!$C$2:$D$495,2,0)","v":{"$error":"#N/A"}},{"$error":"#N/A"},"A",{"$error":"#N/A"}]
[36,null,"NOVA PRASETIYO",{"$f":"VLOOKUP(E16,Sheet1!$C$2:$D$495,2,0)","v":{"$error":"#N/A"}},{"$error":"#N/A"},"A",{"$error":"#N/A"}]
[23,170187,"NOVA PRASETIYO",{"$f":"VLOOKUP(E17,Sheet1!$C$2:$D$495,2,0)","v":{"$error":"#N/A"}},{"$error":"#N/A"},"D",{"$error":"#N/A"}]
[33,170311,"AMAR FARICKHIN",{"$f":"VLOOKUP(E18,Sheet1!$C$2:$D$495,2,0)","v":{"$error":"#N/A"}},{"$error":"#N/A"},"D",{"$error":"#N/A"}]
[7,170337,"MENTARI RIZKI EGAYANTI",{"$f":"VLOOKUP(E19,Sheet1!$C$2:$D$495,2,0)","v":{"$error":"#N/A"}},{"$error":"#N/A"},"D",{"$error":"#N/A"}]
[37,"16.11.0288","YOUNGKY RICKY AREIF WIBOWO",{"$f":"VLOOKUP(E20,Sheet1!$C$2:$D$495,2,0)","v":{"$error":"#N/A"}},"16.11.0288","A",{"$error":"#N/A"}]

{"sheet":"26-27","index":5,"n_rows":264,"n_cols":10,"rows_kept":264,"merged":[[0,0,0,3],[0,6,0,9],[1,0,1,3],[1,6,1,9],[2,0,2,3],[2,6,2,9],[3,0,3,3],[3,6,3,9],[5,0,6,0],[5,1,6,1],[5,2,6,2],[5,3,6,3],[5,6,6,6],[5,7,6,7],[5,8,6,8],[5,9,6,9],[61,0,61,3],[61,6,61,9],[62,0,62,3],[62,6,62,9],[63,0,63,3],[63,6,63,9],[64,0,64,3],[64,6,64,9],[66,0,67,0],[66,1,67,1],[66,2,67,2],[66,3,67,3],[66,6,67,6],[66,7,67,7],[66,8,67,8],[66,9,67,9],[102,0,102,3],[102,6,102,9],[103,0,103,3],[103,6,103,9],[104,0,104,3],[104,6,104,9],[105,0,105,3],[105,6,105,9],[107,0,108,0],[107,1,108,1],[107,2,108,2],[107,3,108,3],[107,6,108,6],[107,7,108,7],[107,8,108,8],[107,9,108,9],[143,0,143,3],[143,6,143,9],[144,0,144,3],[144,6,144,9],[145,0,145,3],[145,6,145,9],[146,0,146,3],[146,6,146,9],[148,0,149,0],[148,1,149,1],[148,2,149,2],[148,3,149,3],[148,6,149,6],[148,7,149,7],[148,8,149,8],[148,9,149,9],[184,0,184,3],[184,6,184,9],[185,0,185,3],[185,6,185,9],[186,0,186,3],[186,6,186,9],[187,0,187,3],[187,6,187,9],[189,0,190,0],[189,1,190,1],[189,2,190,2],[189,3,190,3],[189,6,190,6],[189,7,190,7],[189,8,190,8],[189,9,190,9],[225,0,225,3],[225,6,225,9],[226,0,226,3],[226,6,226,9],[227,0,227,3],[227,6,227,9],[228,0,228,3],[228,6,228,9],[230,0,231,0],[230,1,231,1],[230,2,231,2],[230,3,231,3],[230,6,231,6],[230,7,231,7],[230,8,231,8],[230,9,231,9]]}
["KELOMPOK PELATIHAN SUPER UNGGUL (PSU)",{"$nulls":5},"KELOMPOK PELATIHAN SUPER UNGGUL (PSU)"]
["KELOMPOK P.5 ( Ruang AULA )",{"$nulls":5},"KELOMPOK S.5 ( Ruang AULA )"]
["RABU-KAMIS, 26-27 JANUARI 2022",{"$nulls":5},"RABU-KAMIS, 26-27 JANUARI 2022"]
["08.30-12.30 WIB",{"$nulls":5},"13.00-17.00 WIB"]
[]
["NO.","NIM","NAMA","PRODI",null,null,"NO.","NO.DAF","NAMA","PRODI"]
[]
[1,"21SA1007","IQBAL ARIEFTIAN MAULANA","IF",null,null,1,"21SA1016","RIZAL KURNIAWAN","IF"]
[2,"21SA1036","RIKY DIMAS DERMAWAN","IF",null,null,2,"21SA1024","NIKMAH TRINARSIH","IF"]
[3,"21SA1067","M.ABDUL ROHMAN","IF",null,null,3,"21SA1042","NUGROHO MOHAMAD AL AZIZ","IF"]
[4,"21SA1081","TIKA DIANASARI","IF",null,null,4,"21SA1076","FAQIH ROFIQI","IF"]
[5,"21SA1087","SITI NUR VAIZA PEBRIYANTI","IF",null,null,5,"21SA1077","BAGUS AJI PRASETYO","IF"]
[6,"21SA1093","BEMBY MIFTAKHUL FAJRIN","IF",null,null,6,"21SA1099","GUNTUR SETIAWAN","IF"]
[7,"21SA1094","ADEN NUR HIDAYATULLOH","IF",null,null,7,"21SA1100","MUHAMMAD SABILLI AR-RAZIQA","IF"]
[8,"21SA1123","ILHAM PRASETYO","IF",null,null,8,"21SA1110","ULFIATUN KHASANAH","IF"]
[9,"21SA1126","WAHYU IHWANUDIN","IF",null,null,9,"21SA1113","LULU SHAFIRA","IF"]
[10,"21SA1152","KELVIN ADI WIGUNA","IF",null,null,10,"21SA1135","DEBI IRIANTO","IF"]
[11,"21SA1155","MUHAMMAD ARKAN HAFI","IF",null,null,11,"21SA1136","FAIZ NURRAMDANI","IF"]
[12,"21SA1164","RAHMATIA","IF",null,null,12,"21SA1165","TRI ABDUL GHANI","IF"]
[13,"21SA1182","ADITYA PRIMUKTI","IF",null,null,13,"21SA1188","SOIF SOLEH ARIZAL","IF"]
[14,"21SA1204","DWI WAHYU NUGROHO","IF",null,null,14,"21SA1215","ILHAM PRADITHA SATRIAWAN","IF"]
[15,"21SA1238","TAUFIQ RIZKI SOBRINA","IF",null,null,15,"21SA1220","ALDONA SEPTIANA","IF"]
[16,"21SA1240","LATIEF FATKHUR RAHMAN","IF",null,null,16,"21SA1234","ROSY ANNISA GHULFI","IF"]
[17,"21SA1264","NURMA BUDI SANTOSO WIBOWO","IF",null,null,17,"21SA1248","GIAN GUSTIN","IF"]
[18,"21SA1270","RAFIF ZADA PRIYAMBADA","IF",null,null,18,"21SA1251","ADEN HIDAYATULOH","IF"]
[19,"21SA2006","SRI WAHYUNINGSIH","SI",null,null,19,"21SA2016","DEA LILI ANGGRAENI","SI"]
[20,"21SA2009","FARADINA NOVI LAKSHITA","SI",null,null,20,"21SA2018","ANNISA SUCI OCTAVIA","SI"]
[21,"21SA2019","WAHYU PUTRA PRATAMA","SI",null,null,21,"21SA2026","DENI DWI SUSILO","SI"]
[22,"21SA2021","FIRMAN SYAH SETYA BUDI","SI",null,null,22,"21SA2030","ABDILLAH TEGUH PERMANA","SI"]
[23,"21SA2047","LAELA USWATUN HASANAH","SI",null,null,23,"21SA2055","FADHILA INTAN CAHYANINGRUM","SI"]
[24,"21SA2076","RINDIANA PUTRI NATASYA","SI",null,null,24,"21SA2088","SHAFNI NUR HIKMA ROSALIA","SI"]
[25,"21SA2081","MUHAMMAD ASFARI AL-KAROMI","SI",null,null,25,"21SA2101","AHNAF VANNING AL HAQ","SI"]
[26,"21SA2111","EXCEL ERVINTA DESTY","SI",null,null,26,"21SA2117","HASSA LUSIANI SAFITRI","SI"]
[27,"21SA2114","SEKAR AJENG RAMADHANI","SI",null,null,27,"21SA2123","BHARA APRILIAN TUSWANDARU","SI"]
[28,"21SA2138","MUHAMMAD FAUZAN AMIN","SI",null,null,28,"21SA2149","ANZALNA FRESKY GEMPITER SILLHOUTTE","SI"]
[29,"21SA2142","ADITYA PRATAMA","SI",null,null,29,"21SA2154","GHOIS ABDULLAH AKMAL","SI"]
[30,"21SA2155","JESSICA NURANGGITA PUTRI","SI",null,null,30,"21SA3005","HERLAN PRISTANDA NUGRAHA","TI"]
[31,"21SA3001","AL AKBAR JATI BHAGASKARA","TI",null,null,31,"21SA3008","FERDHA ROMADHON","TI"]
[32,"21SA3010","ARMEYTA PUTRI TANZILLA","TI",null,null,32,"21SA3030","FIKRI FIRMANSYAH","TI"]
[33,"21SA3020","VINA PANGGRAITA","TI",null,null,33,"21SA3033","ZAHRAN MUHYIDDIN","TI"]
{"$rows_left_out":224}